juneau-dev mailing list archives

Site index · List index
Message view « Date » · « Thread »
Top « Date » · « Thread »
From Apache Jenkins Server <jenk...@builds.apache.org>
Subject Build failed in Jenkins: Juneau-Java-1.8 #1546
Date Thu, 06 Feb 2020 15:28:45 GMT
See <https://builds.apache.org/job/Juneau-Java-1.8/1546/display/redirect?page=changes>

Changes:

[fiammara] topic about petstore added


------------------------------------------
[...truncated 1.08 MB...]
[INFO] Exclude: **/*.prefs
[INFO] Exclude: **/*.2
[INFO] Exclude: **/jetty.out.xml
[INFO] Exclude: **/derby.log
[INFO] Exclude: **/dependency-reduced-pom.xml
[INFO] Exclude: **/docs.txt
[INFO] Exclude: **/toc.txt
[INFO] Exclude: **/app.json
[INFO] Exclude: **/Procfile
[INFO] 8 resources included (use -debug for more details)
[INFO] Rat check: Summary over all files. Unapproved: 0, unknown: 0, generated: 0, approved:
8 licenses.
[INFO] 
[INFO] --- maven-install-plugin:2.5.2:install (default-install) @ juneau-examples-rest-jetty-ftest
---
[INFO] Installing <https://builds.apache.org/job/Juneau-Java-1.8/ws/juneau-examples/juneau-examples-rest-jetty-ftest/target/juneau-examples-rest-jetty-ftest-8.1.4-SNAPSHOT.jar>
to /home/jenkins/.m2/repository/org/apache/juneau/juneau-examples-rest-jetty-ftest/8.1.4-SNAPSHOT/juneau-examples-rest-jetty-ftest-8.1.4-SNAPSHOT.jar
[INFO] Installing <https://builds.apache.org/job/Juneau-Java-1.8/ws/juneau-examples/juneau-examples-rest-jetty-ftest/pom.xml>
to /home/jenkins/.m2/repository/org/apache/juneau/juneau-examples-rest-jetty-ftest/8.1.4-SNAPSHOT/juneau-examples-rest-jetty-ftest-8.1.4-SNAPSHOT.pom
[INFO] 
[INFO] --- maven-enforcer-plugin:1.4.1:enforce (enforce-maven-version) @ juneau-examples-rest-jetty-ftest
---
[INFO] 
[INFO] --- maven-enforcer-plugin:1.4.1:enforce (enforce-maven) @ juneau-examples-rest-jetty-ftest
---
[INFO] 
[INFO] --- jacoco-maven-plugin:0.8.2:prepare-agent (default-prepare-agent) @ juneau-examples-rest-jetty-ftest
---
[INFO] argLine set to -javaagent:/home/jenkins/.m2/repository/org/jacoco/org.jacoco.agent/0.8.2/org.jacoco.agent-0.8.2-runtime.jar=destfile=<https://builds.apache.org/job/Juneau-Java-1.8/ws/juneau-examples/juneau-examples-rest-jetty-ftest/target/jacoco.exec>
[INFO] 
[INFO] --- maven-remote-resources-plugin:1.5:process (process-resource-bundles) @ juneau-examples-rest-jetty-ftest
---
[INFO] 
[INFO] --- maven-resources-plugin:3.1.0:resources (default-resources) @ juneau-examples-rest-jetty-ftest
---
[INFO] Using 'UTF-8' encoding to copy filtered resources.
[INFO] skip non existing resourceDirectory <https://builds.apache.org/job/Juneau-Java-1.8/ws/juneau-examples/juneau-examples-rest-jetty-ftest/src/main/resources>
[INFO] Copying 3 resources
[INFO] Copying 3 resources
[INFO] 
[INFO] --- maven-compiler-plugin:3.7.0:compile (default-compile) @ juneau-examples-rest-jetty-ftest
---
[INFO] Nothing to compile - all classes are up to date
[INFO] 
[INFO] --- maven-resources-plugin:3.1.0:testResources (default-testResources) @ juneau-examples-rest-jetty-ftest
---
[INFO] Using 'UTF-8' encoding to copy filtered resources.
[INFO] skip non existing resourceDirectory <https://builds.apache.org/job/Juneau-Java-1.8/ws/juneau-examples/juneau-examples-rest-jetty-ftest/src/test/resources>
[INFO] Copying 3 resources
[INFO] Copying 3 resources
[INFO] 
[INFO] --- maven-compiler-plugin:3.7.0:testCompile (default-testCompile) @ juneau-examples-rest-jetty-ftest
---
[INFO] Nothing to compile - all classes are up to date
[INFO] 
[INFO] --- maven-surefire-plugin:2.22.0:test (default-test) @ juneau-examples-rest-jetty-ftest
---
[INFO] Skipping execution of surefire because it has already been run for this configuration
[INFO] 
[INFO] --- jacoco-maven-plugin:0.8.2:report (default-report) @ juneau-examples-rest-jetty-ftest
---
[INFO] Loading execution data file <https://builds.apache.org/job/Juneau-Java-1.8/ws/juneau-examples/juneau-examples-rest-jetty-ftest/target/jacoco.exec>
[INFO] Analyzed bundle 'juneau/examples/examples-rest-jetty-ftest' with 0 classes
[INFO] 
[INFO] --- maven-jar-plugin:3.1.0:jar (default-jar) @ juneau-examples-rest-jetty-ftest ---
[INFO] Building jar: <https://builds.apache.org/job/Juneau-Java-1.8/ws/juneau-examples/juneau-examples-rest-jetty-ftest/target/juneau-examples-rest-jetty-ftest-8.1.4-SNAPSHOT.jar>
[INFO] 
[INFO] --- maven-site-plugin:3.7.1:attach-descriptor (attach-descriptor) @ juneau-examples-rest-jetty-ftest
---
[INFO] Skipping because packaging 'jar' is not pom.
[INFO] 
[INFO] --- apache-rat-plugin:0.12:check (default) @ juneau-examples-rest-jetty-ftest ---
[INFO] Enabled default license matchers.
[INFO] Will parse SCM ignores for exclusions...
[INFO] Parsing exclusions from <https://builds.apache.org/job/Juneau-Java-1.8/ws/juneau-examples/juneau-examples-rest-jetty-ftest/.gitignore>
[INFO] Finished adding exclusions from SCM ignore files.
[INFO] 65 implicit excludes (use -debug for more details).
[INFO] Exclude: **/DEPENDENCIES
[INFO] Exclude: **/target/**
[INFO] Exclude: **/empty.txt
[INFO] Exclude: **/.settings/**
[INFO] Exclude: **/.project
[INFO] Exclude: **/.classpath
[INFO] Exclude: **/*.launch
[INFO] Exclude: **/*.prefs
[INFO] Exclude: **/*.2
[INFO] Exclude: **/jetty.out.xml
[INFO] Exclude: **/derby.log
[INFO] Exclude: **/dependency-reduced-pom.xml
[INFO] Exclude: **/docs.txt
[INFO] Exclude: **/toc.txt
[INFO] Exclude: **/app.json
[INFO] Exclude: **/Procfile
[INFO] 8 resources included (use -debug for more details)
[INFO] Rat check: Summary over all files. Unapproved: 0, unknown: 0, generated: 0, approved:
8 licenses.
[INFO] 
[INFO] --- maven-install-plugin:2.5.2:install (default-install) @ juneau-examples-rest-jetty-ftest
---
[INFO] Installing <https://builds.apache.org/job/Juneau-Java-1.8/ws/juneau-examples/juneau-examples-rest-jetty-ftest/target/juneau-examples-rest-jetty-ftest-8.1.4-SNAPSHOT.jar>
to /home/jenkins/.m2/repository/org/apache/juneau/juneau-examples-rest-jetty-ftest/8.1.4-SNAPSHOT/juneau-examples-rest-jetty-ftest-8.1.4-SNAPSHOT.jar
[INFO] Installing <https://builds.apache.org/job/Juneau-Java-1.8/ws/juneau-examples/juneau-examples-rest-jetty-ftest/pom.xml>
to /home/jenkins/.m2/repository/org/apache/juneau/juneau-examples-rest-jetty-ftest/8.1.4-SNAPSHOT/juneau-examples-rest-jetty-ftest-8.1.4-SNAPSHOT.pom
[INFO] 
[INFO] --- maven-deploy-plugin:2.8.2:deploy (default-deploy) @ juneau-examples-rest-jetty-ftest
---
Downloading: https://repository.apache.org/content/repositories/snapshots/org/apache/juneau/juneau-examples-rest-jetty-ftest/8.1.4-SNAPSHOT/maven-metadata.xml
802/802 B               Downloaded: https://repository.apache.org/content/repositories/snapshots/org/apache/juneau/juneau-examples-rest-jetty-ftest/8.1.4-SNAPSHOT/maven-metadata.xml
(802 B at 1.3 KB/sec)
Uploading: https://repository.apache.org/content/repositories/snapshots/org/apache/juneau/juneau-examples-rest-jetty-ftest/8.1.4-SNAPSHOT/juneau-examples-rest-jetty-ftest-8.1.4-20200206.152814-54.jar
2/10 KB     4/10 KB   6/10 KB   8/10 KB   10/10 KB              Uploaded: https://repository.apache.org/content/repositories/snapshots/org/apache/juneau/juneau-examples-rest-jetty-ftest/8.1.4-SNAPSHOT/juneau-examples-rest-jetty-ftest-8.1.4-20200206.152814-54.jar
(10 KB at 9.7 KB/sec)
Uploading: https://repository.apache.org/content/repositories/snapshots/org/apache/juneau/juneau-examples-rest-jetty-ftest/8.1.4-SNAPSHOT/juneau-examples-rest-jetty-ftest-8.1.4-20200206.152814-54.pom
2/4 KB     4/4 KB            Uploaded: https://repository.apache.org/content/repositories/snapshots/org/apache/juneau/juneau-examples-rest-jetty-ftest/8.1.4-SNAPSHOT/juneau-examples-rest-jetty-ftest-8.1.4-20200206.152814-54.pom
(4 KB at 4.3 KB/sec)
Downloading: https://repository.apache.org/content/repositories/snapshots/org/apache/juneau/juneau-examples-rest-jetty-ftest/maven-metadata.xml
409/409 B               Downloaded: https://repository.apache.org/content/repositories/snapshots/org/apache/juneau/juneau-examples-rest-jetty-ftest/maven-metadata.xml
(409 B at 0.6 KB/sec)
Uploading: https://repository.apache.org/content/repositories/snapshots/org/apache/juneau/juneau-examples-rest-jetty-ftest/8.1.4-SNAPSHOT/maven-metadata.xml
802/802 B               Uploaded: https://repository.apache.org/content/repositories/snapshots/org/apache/juneau/juneau-examples-rest-jetty-ftest/8.1.4-SNAPSHOT/maven-metadata.xml
(802 B at 0.9 KB/sec)
Uploading: https://repository.apache.org/content/repositories/snapshots/org/apache/juneau/juneau-examples-rest-jetty-ftest/maven-metadata.xml
409/409 B               Uploaded: https://repository.apache.org/content/repositories/snapshots/org/apache/juneau/juneau-examples-rest-jetty-ftest/maven-metadata.xml
(409 B at 0.4 KB/sec)
[INFO]                                                                         
[INFO] ------------------------------------------------------------------------
[INFO] Building juneau/doc 8.1.4-SNAPSHOT
[INFO] ------------------------------------------------------------------------
[INFO] 
[INFO] --- maven-clean-plugin:3.1.0:clean (default-clean) @ juneau-doc ---
[INFO] Deleting <https://builds.apache.org/job/Juneau-Java-1.8/ws/juneau-doc/target>
[INFO] 
[INFO] --- maven-enforcer-plugin:1.4.1:enforce (enforce-maven-version) @ juneau-doc ---
[INFO] 
[INFO] --- maven-enforcer-plugin:1.4.1:enforce (enforce-maven) @ juneau-doc ---
[INFO] 
[INFO] --- maven-remote-resources-plugin:1.5:process (process-resource-bundles) @ juneau-doc
---
[INFO] 
[INFO] --- maven-resources-plugin:3.1.0:resources (default-resources) @ juneau-doc ---
[INFO] Using 'UTF-8' encoding to copy filtered resources.
[INFO] skip non existing resourceDirectory <https://builds.apache.org/job/Juneau-Java-1.8/ws/juneau-doc/src/main/resources>
[INFO] Copying 3 resources
[INFO] 
[INFO] --- maven-compiler-plugin:3.7.0:compile (default-compile) @ juneau-doc ---
[INFO] Changes detected - recompiling the module!
[INFO] Compiling 10 source files to <https://builds.apache.org/job/Juneau-Java-1.8/ws/juneau-doc/target/classes>
[INFO] 
[INFO] --- maven-resources-plugin:3.1.0:testResources (default-testResources) @ juneau-doc
---
[INFO] Using 'UTF-8' encoding to copy filtered resources.
[INFO] skip non existing resourceDirectory <https://builds.apache.org/job/Juneau-Java-1.8/ws/juneau-doc/src/test/resources>
[INFO] Copying 3 resources
[INFO] 
[INFO] --- maven-compiler-plugin:3.7.0:testCompile (default-testCompile) @ juneau-doc ---
[INFO] No sources to compile
[INFO] 
[INFO] --- maven-surefire-plugin:2.22.0:test (default-test) @ juneau-doc ---
[INFO] 
[INFO] --- maven-bundle-plugin:3.2.0:bundle (default-bundle) @ juneau-doc ---
[INFO] 
[INFO] --- maven-site-plugin:3.7.1:attach-descriptor (attach-descriptor) @ juneau-doc ---
[INFO] Skipping because packaging 'bundle' is not pom.
[INFO] 
[INFO] --- apache-rat-plugin:0.12:check (default) @ juneau-doc ---
[INFO] Enabled default license matchers.
[INFO] Will parse SCM ignores for exclusions...
[INFO] Parsing exclusions from <https://builds.apache.org/job/Juneau-Java-1.8/ws/juneau-doc/.gitignore>
[INFO] Finished adding exclusions from SCM ignore files.
[INFO] 64 implicit excludes (use -debug for more details).
[INFO] Exclude: **/DEPENDENCIES
[INFO] Exclude: **/target/**
[INFO] Exclude: **/empty.txt
[INFO] Exclude: **/.settings/**
[INFO] Exclude: **/.project
[INFO] Exclude: **/.classpath
[INFO] Exclude: **/*.launch
[INFO] Exclude: **/*.prefs
[INFO] Exclude: **/*.2
[INFO] Exclude: **/jetty.out.xml
[INFO] Exclude: **/derby.log
[INFO] Exclude: **/dependency-reduced-pom.xml
[INFO] Exclude: **/docs.txt
[INFO] Exclude: **/toc.txt
[INFO] Exclude: **/app.json
[INFO] Exclude: **/Procfile
[INFO] 631 resources included (use -debug for more details)
[INFO] Rat check: Summary over all files. Unapproved: 1, unknown: 1, generated: 0, approved:
422 licenses.
[INFO] Enabled default license matchers.
[INFO] Will parse SCM ignores for exclusions...
[INFO] Parsing exclusions from <https://builds.apache.org/job/Juneau-Java-1.8/ws/juneau-doc/.gitignore>
[INFO] Finished adding exclusions from SCM ignore files.
[INFO] 64 implicit excludes (use -debug for more details).
[INFO] Exclude: **/DEPENDENCIES
[INFO] Exclude: **/target/**
[INFO] Exclude: **/empty.txt
[INFO] Exclude: **/.settings/**
[INFO] Exclude: **/.project
[INFO] Exclude: **/.classpath
[INFO] Exclude: **/*.launch
[INFO] Exclude: **/*.prefs
[INFO] Exclude: **/*.2
[INFO] Exclude: **/jetty.out.xml
[INFO] Exclude: **/derby.log
[INFO] Exclude: **/dependency-reduced-pom.xml
[INFO] Exclude: **/docs.txt
[INFO] Exclude: **/toc.txt
[INFO] Exclude: **/app.json
[INFO] Exclude: **/Procfile
[INFO] 631 resources included (use -debug for more details)
[WARNING] Files with unapproved licenses:
  <https://builds.apache.org/job/Juneau-Java-1.8/ws/juneau-doc/docs/Topics/19.juneau-petstore/04.PetstoreApp.html>
[INFO]                                                                         
[INFO] ------------------------------------------------------------------------
[INFO] Skipping juneau
[INFO] This project has been banned from the build due to previous failures.
[INFO] ------------------------------------------------------------------------
[INFO] ------------------------------------------------------------------------
[INFO] Reactor Summary:
[INFO] 
[INFO] juneau ............................................. SUCCESS [  7.680 s]
[INFO] juneau/core ........................................ SUCCESS [  4.331 s]
[INFO] juneau/core/marshall ............................... SUCCESS [ 51.918 s]
[INFO] juneau/core/marshall-rdf ........................... SUCCESS [ 12.739 s]
[INFO] juneau/core/dto .................................... SUCCESS [ 15.261 s]
[INFO] juneau/core/config ................................. SUCCESS [ 11.086 s]
[INFO] juneau/core/core-utest ............................. SUCCESS [ 51.718 s]
[INFO] juneau/rest ........................................ SUCCESS [  4.195 s]
[INFO] juneau/rest/rest-server ............................ SUCCESS [ 21.055 s]
[INFO] juneau/rest/rest-server-jaxrs ...................... SUCCESS [  9.874 s]
[INFO] juneau/rest/rest-server-rdf ........................ SUCCESS [ 16.681 s]
[INFO] juneau/rest/rest-server-springboot ................. SUCCESS [ 18.405 s]
[INFO] juneau/rest/rest-client ............................ SUCCESS [ 15.445 s]
[INFO] juneau/rest/rest-mock .............................. SUCCESS [ 11.265 s]
[INFO] juneau/rest/rest-mock-utest ........................ SUCCESS [ 14.185 s]
[INFO] juneau/rest/rest-server-utest ...................... SUCCESS [ 32.256 s]
[INFO] juneau/rest/rest-client-utest ...................... SUCCESS [ 12.181 s]
[INFO] juneau/microservice ................................ SUCCESS [  4.037 s]
[INFO] juneau/microservice/microservice-core .............. SUCCESS [ 10.048 s]
[INFO] juneau/microservice/microservice-jetty ............. SUCCESS [ 10.123 s]
[INFO] juneau/microservice/my-jetty-microservice .......... SUCCESS [  9.945 s]
[INFO] juneau/examples .................................... SUCCESS [  4.064 s]
[INFO] juneau/examples/rest ............................... SUCCESS [ 11.415 s]
[INFO] juneau/microservice/microservice-ftest ............. SUCCESS [ 35.754 s]
[INFO] juneau/microservice/my-springboot-microservice ..... SUCCESS [ 10.848 s]
[INFO] juneau/sc .......................................... SUCCESS [  4.048 s]
[INFO] juneau/sc/sc-server ................................ SUCCESS [ 13.422 s]
[INFO] juneau/sc/sc-client ................................ SUCCESS [  8.476 s]
[INFO] juneau/examples/examples-core ...................... SUCCESS [  9.485 s]
[INFO] juneau/examples/examples-rest-jetty ................ SUCCESS [ 14.511 s]
[INFO] juneau/examples/examples-rest-springboot ........... SUCCESS [ 27.113 s]
[INFO] juneau/examples/examples-rest-jetty-ftest .......... SUCCESS [ 13.180 s]
[INFO] juneau/doc ......................................... FAILURE [  1.374 s]
[INFO] juneau/releng ...................................... SKIPPED
[INFO] juneau/releng/all .................................. SKIPPED
[INFO] juneau/releng/distrib .............................. SKIPPED
[INFO] ------------------------------------------------------------------------
[INFO] BUILD FAILURE
[INFO] ------------------------------------------------------------------------
[INFO] Total time: 08:19 min
[INFO] Finished at: 2020-02-06T15:28:20+00:00
[INFO] Final Memory: 139M/3193M
[INFO] ------------------------------------------------------------------------
[ERROR] Failed to execute goal org.apache.rat:apache-rat-plugin:0.12:check (default) on project
juneau-doc: Too many files with unapproved license: 1 See RAT report in: <https://builds.apache.org/job/Juneau-Java-1.8/ws/juneau-doc/target/rat.txt>
-> [Help 1]
[ERROR] 
[ERROR] To see the full stack trace of the errors, re-run Maven with the -e switch.
[ERROR] Re-run Maven using the -X switch to enable full debug logging.
[ERROR] 
[ERROR] For more information about the errors and possible solutions, please read the following
articles:
[ERROR] [Help 1] http://cwiki.apache.org/confluence/display/MAVEN/MojoFailureException
[ERROR] 
[ERROR] After correcting the problems, you can resume the build with the command
[ERROR]   mvn <goals> -rf :juneau-doc
Build step 'Invoke top-level Maven targets' marked build as failure
Recording test results
[TASKS] Skipping publisher since build result is FAILURE
Not sending mail to unregistered user fiammara@gmail.com

Mime
View raw message