juneau-dev mailing list archives

Site index · List index
Message view « Date » · « Thread »
Top « Date » · « Thread »
From Apache Jenkins Server <jenk...@builds.apache.org>
Subject Build failed in Jenkins: Juneau-Java-1.8 #1504
Date Thu, 02 Jan 2020 19:14:56 GMT
See <https://builds.apache.org/job/Juneau-Java-1.8/1504/display/redirect?page=changes>

Changes:

[JamesBognar] JUNEAU-171 BasicRest class doesn't work correctly with Spring Security.

[JamesBognar] JUNEAU-172 @RestResource(debug=true) doesn't work if REST method not

[JamesBognar] JUNEAU-173 Undeprecate HttpClientBuilder convenience methods in


------------------------------------------
[...truncated 551.75 KB...]
[INFO] 
[INFO] --- maven-assembly-plugin:3.0.0:single (juneau-assembly) @ juneau-my-jetty-microservice
---
[INFO] Reading assembly descriptor: src/assembly/bin.xml
[WARNING] The assembly descriptor contains a filesystem-root relative reference, which is
not cross platform compatible /
[WARNING] The assembly descriptor contains a filesystem-root relative reference, which is
not cross platform compatible /
[WARNING] The assembly descriptor contains a filesystem-root relative reference, which is
not cross platform compatible /
[WARNING] The assembly descriptor contains a filesystem-root relative reference, which is
not cross platform compatible /
[WARNING] The assembly descriptor contains a filesystem-root relative reference, which is
not cross platform compatible /
[INFO] Building zip: <https://builds.apache.org/job/Juneau-Java-1.8/ws/juneau-microservice/juneau-my-jetty-microservice/target/my-jetty-microservice-8.1.3-SNAPSHOT-bin.zip>
[INFO] 
[INFO] --- apache-rat-plugin:0.12:check (default) @ juneau-my-jetty-microservice ---
[INFO] Enabled default license matchers.
[INFO] Will parse SCM ignores for exclusions...
[INFO] Parsing exclusions from <https://builds.apache.org/job/Juneau-Java-1.8/ws/juneau-microservice/juneau-my-jetty-microservice/.gitignore>
[INFO] Finished adding exclusions from SCM ignore files.
[INFO] 64 implicit excludes (use -debug for more details).
[INFO] Exclude: **/DEPENDENCIES
[INFO] Exclude: **/target/**
[INFO] Exclude: **/empty.txt
[INFO] Exclude: **/.settings/**
[INFO] Exclude: **/.project
[INFO] Exclude: **/.classpath
[INFO] Exclude: **/*.launch
[INFO] Exclude: **/*.prefs
[INFO] Exclude: **/*.2
[INFO] Exclude: **/jetty.out.xml
[INFO] Exclude: **/derby.log
[INFO] Exclude: **/dependency-reduced-pom.xml
[INFO] Exclude: **/docs.txt
[INFO] Exclude: **/toc.txt
[INFO] Exclude: **/app.json
[INFO] Exclude: **/Procfile
[INFO] 10 resources included (use -debug for more details)
[INFO] Rat check: Summary over all files. Unapproved: 0, unknown: 0, generated: 0, approved:
10 licenses.
[INFO] 
[INFO] --- maven-install-plugin:2.5.2:install (default-install) @ juneau-my-jetty-microservice
---
[INFO] Installing <https://builds.apache.org/job/Juneau-Java-1.8/ws/juneau-microservice/juneau-my-jetty-microservice/target/juneau-my-jetty-microservice-8.1.3-SNAPSHOT.jar>
to /home/jenkins/.m2/repository/org/apache/juneau/juneau-my-jetty-microservice/8.1.3-SNAPSHOT/juneau-my-jetty-microservice-8.1.3-SNAPSHOT.jar
[INFO] Installing <https://builds.apache.org/job/Juneau-Java-1.8/ws/juneau-microservice/juneau-my-jetty-microservice/pom.xml>
to /home/jenkins/.m2/repository/org/apache/juneau/juneau-my-jetty-microservice/8.1.3-SNAPSHOT/juneau-my-jetty-microservice-8.1.3-SNAPSHOT.pom
[INFO] Installing <https://builds.apache.org/job/Juneau-Java-1.8/ws/juneau-microservice/juneau-my-jetty-microservice/target/my-jetty-microservice-8.1.3-SNAPSHOT-bin.zip>
to /home/jenkins/.m2/repository/org/apache/juneau/juneau-my-jetty-microservice/8.1.3-SNAPSHOT/juneau-my-jetty-microservice-8.1.3-SNAPSHOT-bin.zip
[INFO] Installing <https://builds.apache.org/job/Juneau-Java-1.8/ws/juneau-microservice/juneau-my-jetty-microservice/target/my-jetty-microservice-8.1.3-SNAPSHOT-bin.zip>
to /home/jenkins/.m2/repository/org/apache/juneau/juneau-my-jetty-microservice/8.1.3-SNAPSHOT/juneau-my-jetty-microservice-8.1.3-SNAPSHOT-bin.zip
[INFO] 
[INFO] --- maven-deploy-plugin:2.8.2:deploy (default-deploy) @ juneau-my-jetty-microservice
---
Downloading: https://repository.apache.org/content/repositories/snapshots/org/apache/juneau/juneau-my-jetty-microservice/8.1.3-SNAPSHOT/maven-metadata.xml
1009/1009 B                 Downloaded: https://repository.apache.org/content/repositories/snapshots/org/apache/juneau/juneau-my-jetty-microservice/8.1.3-SNAPSHOT/maven-metadata.xml
(1009 B at 1.6 KB/sec)
Uploading: https://repository.apache.org/content/repositories/snapshots/org/apache/juneau/juneau-my-jetty-microservice/8.1.3-SNAPSHOT/juneau-my-jetty-microservice-8.1.3-20200102.191425-37.jar
2/13 KB       4/13 KB   6/13 KB   8/13 KB   10/13 KB   12/13 KB   13/13 KB              Uploaded:
https://repository.apache.org/content/repositories/snapshots/org/apache/juneau/juneau-my-jetty-microservice/8.1.3-SNAPSHOT/juneau-my-jetty-microservice-8.1.3-20200102.191425-37.jar
(13 KB at 8.6 KB/sec)
Uploading: https://repository.apache.org/content/repositories/snapshots/org/apache/juneau/juneau-my-jetty-microservice/8.1.3-SNAPSHOT/juneau-my-jetty-microservice-8.1.3-20200102.191425-37.pom
2/4 KB     4/4 KB            Uploaded: https://repository.apache.org/content/repositories/snapshots/org/apache/juneau/juneau-my-jetty-microservice/8.1.3-SNAPSHOT/juneau-my-jetty-microservice-8.1.3-20200102.191425-37.pom
(4 KB at 4.1 KB/sec)
Downloading: https://repository.apache.org/content/repositories/snapshots/org/apache/juneau/juneau-my-jetty-microservice/maven-metadata.xml
405/405 B               Downloaded: https://repository.apache.org/content/repositories/snapshots/org/apache/juneau/juneau-my-jetty-microservice/maven-metadata.xml
(405 B at 0.6 KB/sec)
Uploading: https://repository.apache.org/content/repositories/snapshots/org/apache/juneau/juneau-my-jetty-microservice/8.1.3-SNAPSHOT/maven-metadata.xml
1009/1009 B                 Uploaded: https://repository.apache.org/content/repositories/snapshots/org/apache/juneau/juneau-my-jetty-microservice/8.1.3-SNAPSHOT/maven-metadata.xml
(1009 B at 1.0 KB/sec)
Uploading: https://repository.apache.org/content/repositories/snapshots/org/apache/juneau/juneau-my-jetty-microservice/maven-metadata.xml
405/405 B                 Uploaded: https://repository.apache.org/content/repositories/snapshots/org/apache/juneau/juneau-my-jetty-microservice/maven-metadata.xml
(405 B at 0.4 KB/sec)
Uploading: https://repository.apache.org/content/repositories/snapshots/org/apache/juneau/juneau-my-jetty-microservice/8.1.3-SNAPSHOT/juneau-my-jetty-microservice-8.1.3-20200102.191425-37-bin.zip
2/14 KB     4/14 KB   6/14 KB   8/14 KB   10/14 KB   12/14 KB   14/14 KB              Uploaded:
https://repository.apache.org/content/repositories/snapshots/org/apache/juneau/juneau-my-jetty-microservice/8.1.3-SNAPSHOT/juneau-my-jetty-microservice-8.1.3-20200102.191425-37-bin.zip
(14 KB at 10.8 KB/sec)
Uploading: https://repository.apache.org/content/repositories/snapshots/org/apache/juneau/juneau-my-jetty-microservice/8.1.3-SNAPSHOT/maven-metadata.xml
1009/1009 B                 Uploaded: https://repository.apache.org/content/repositories/snapshots/org/apache/juneau/juneau-my-jetty-microservice/8.1.3-SNAPSHOT/maven-metadata.xml
(1009 B at 1.1 KB/sec)
Uploading: https://repository.apache.org/content/repositories/snapshots/org/apache/juneau/juneau-my-jetty-microservice/8.1.3-SNAPSHOT/juneau-my-jetty-microservice-8.1.3-20200102.191425-37-bin.zip
2/14 KB       4/14 KB   6/14 KB   8/14 KB   10/14 KB   12/14 KB   14/14 KB              Uploaded:
https://repository.apache.org/content/repositories/snapshots/org/apache/juneau/juneau-my-jetty-microservice/8.1.3-SNAPSHOT/juneau-my-jetty-microservice-8.1.3-20200102.191425-37-bin.zip
(14 KB at 13.9 KB/sec)
Uploading: https://repository.apache.org/content/repositories/snapshots/org/apache/juneau/juneau-my-jetty-microservice/8.1.3-SNAPSHOT/maven-metadata.xml
1009/1009 B                 Uploaded: https://repository.apache.org/content/repositories/snapshots/org/apache/juneau/juneau-my-jetty-microservice/8.1.3-SNAPSHOT/maven-metadata.xml
(1009 B at 0.9 KB/sec)
[INFO]                                                                         
[INFO] ------------------------------------------------------------------------
[INFO] Building juneau/examples 8.1.3-SNAPSHOT
[INFO] ------------------------------------------------------------------------
[INFO] 
[INFO] --- maven-clean-plugin:3.1.0:clean (default-clean) @ juneau-examples ---
[INFO] Deleting <https://builds.apache.org/job/Juneau-Java-1.8/ws/juneau-examples/target>
[INFO] 
[INFO] --- maven-enforcer-plugin:1.4.1:enforce (enforce-maven-version) @ juneau-examples ---
[INFO] 
[INFO] --- maven-enforcer-plugin:1.4.1:enforce (enforce-maven) @ juneau-examples ---
[INFO] 
[INFO] --- maven-remote-resources-plugin:1.5:process (process-resource-bundles) @ juneau-examples
---
[INFO] 
[INFO] --- maven-site-plugin:3.7.1:attach-descriptor (attach-descriptor) @ juneau-examples
---
[INFO] No site descriptor found: nothing to attach.
[INFO] 
[INFO] --- apache-rat-plugin:0.12:check (default) @ juneau-examples ---
[INFO] Enabled default license matchers.
[INFO] Will parse SCM ignores for exclusions...
[INFO] Parsing exclusions from <https://builds.apache.org/job/Juneau-Java-1.8/ws/juneau-examples/.gitignore>
[INFO] Finished adding exclusions from SCM ignore files.
[INFO] 69 implicit excludes (use -debug for more details).
[INFO] Exclude: **/DEPENDENCIES
[INFO] Exclude: **/target/**
[INFO] Exclude: **/empty.txt
[INFO] Exclude: **/.settings/**
[INFO] Exclude: **/.project
[INFO] Exclude: **/.classpath
[INFO] Exclude: **/*.launch
[INFO] Exclude: **/*.prefs
[INFO] Exclude: **/*.2
[INFO] Exclude: **/jetty.out.xml
[INFO] Exclude: **/derby.log
[INFO] Exclude: **/dependency-reduced-pom.xml
[INFO] Exclude: **/docs.txt
[INFO] Exclude: **/toc.txt
[INFO] Exclude: **/app.json
[INFO] Exclude: **/Procfile
[INFO] 1 resources included (use -debug for more details)
[INFO] Rat check: Summary over all files. Unapproved: 0, unknown: 0, generated: 0, approved:
1 licenses.
[INFO] 
[INFO] --- maven-install-plugin:2.5.2:install (default-install) @ juneau-examples ---
[INFO] Installing <https://builds.apache.org/job/Juneau-Java-1.8/ws/juneau-examples/pom.xml>
to /home/jenkins/.m2/repository/org/apache/juneau/juneau-examples/8.1.3-SNAPSHOT/juneau-examples-8.1.3-SNAPSHOT.pom
[INFO] 
[INFO] --- maven-enforcer-plugin:1.4.1:enforce (enforce-maven-version) @ juneau-examples ---
[INFO] 
[INFO] --- maven-enforcer-plugin:1.4.1:enforce (enforce-maven) @ juneau-examples ---
[INFO] 
[INFO] --- maven-remote-resources-plugin:1.5:process (process-resource-bundles) @ juneau-examples
---
[INFO] 
[INFO] --- maven-site-plugin:3.7.1:attach-descriptor (attach-descriptor) @ juneau-examples
---
[INFO] No site descriptor found: nothing to attach.
[INFO] 
[INFO] --- apache-rat-plugin:0.12:check (default) @ juneau-examples ---
[INFO] Enabled default license matchers.
[INFO] Will parse SCM ignores for exclusions...
[INFO] Parsing exclusions from <https://builds.apache.org/job/Juneau-Java-1.8/ws/juneau-examples/.gitignore>
[INFO] Finished adding exclusions from SCM ignore files.
[INFO] 69 implicit excludes (use -debug for more details).
[INFO] Exclude: **/DEPENDENCIES
[INFO] Exclude: **/target/**
[INFO] Exclude: **/empty.txt
[INFO] Exclude: **/.settings/**
[INFO] Exclude: **/.project
[INFO] Exclude: **/.classpath
[INFO] Exclude: **/*.launch
[INFO] Exclude: **/*.prefs
[INFO] Exclude: **/*.2
[INFO] Exclude: **/jetty.out.xml
[INFO] Exclude: **/derby.log
[INFO] Exclude: **/dependency-reduced-pom.xml
[INFO] Exclude: **/docs.txt
[INFO] Exclude: **/toc.txt
[INFO] Exclude: **/app.json
[INFO] Exclude: **/Procfile
[INFO] 1 resources included (use -debug for more details)
[INFO] Rat check: Summary over all files. Unapproved: 0, unknown: 0, generated: 0, approved:
1 licenses.
[INFO] 
[INFO] --- maven-install-plugin:2.5.2:install (default-install) @ juneau-examples ---
[INFO] Installing <https://builds.apache.org/job/Juneau-Java-1.8/ws/juneau-examples/pom.xml>
to /home/jenkins/.m2/repository/org/apache/juneau/juneau-examples/8.1.3-SNAPSHOT/juneau-examples-8.1.3-SNAPSHOT.pom
[INFO] 
[INFO] --- maven-deploy-plugin:2.8.2:deploy (default-deploy) @ juneau-examples ---
Downloading: https://repository.apache.org/content/repositories/snapshots/org/apache/juneau/juneau-examples/8.1.3-SNAPSHOT/maven-metadata.xml
611/611 B                 Downloaded: https://repository.apache.org/content/repositories/snapshots/org/apache/juneau/juneau-examples/8.1.3-SNAPSHOT/maven-metadata.xml
(611 B at 1.0 KB/sec)
Uploading: https://repository.apache.org/content/repositories/snapshots/org/apache/juneau/juneau-examples/8.1.3-SNAPSHOT/juneau-examples-8.1.3-20200102.191435-37.pom
2/3 KB      3/3 KB            Uploaded: https://repository.apache.org/content/repositories/snapshots/org/apache/juneau/juneau-examples/8.1.3-SNAPSHOT/juneau-examples-8.1.3-20200102.191435-37.pom
(3 KB at 2.5 KB/sec)
Downloading: https://repository.apache.org/content/repositories/snapshots/org/apache/juneau/juneau-examples/maven-metadata.xml
665/665 B               Downloaded: https://repository.apache.org/content/repositories/snapshots/org/apache/juneau/juneau-examples/maven-metadata.xml
(665 B at 1.1 KB/sec)
Uploading: https://repository.apache.org/content/repositories/snapshots/org/apache/juneau/juneau-examples/8.1.3-SNAPSHOT/maven-metadata.xml
611/611 B               Uploaded: https://repository.apache.org/content/repositories/snapshots/org/apache/juneau/juneau-examples/8.1.3-SNAPSHOT/maven-metadata.xml
(611 B at 0.7 KB/sec)
Uploading: https://repository.apache.org/content/repositories/snapshots/org/apache/juneau/juneau-examples/maven-metadata.xml
665/665 B               Uploaded: https://repository.apache.org/content/repositories/snapshots/org/apache/juneau/juneau-examples/maven-metadata.xml
(665 B at 0.7 KB/sec)
[INFO]                                                                         
[INFO] ------------------------------------------------------------------------
[INFO] Building juneau/examples/rest 8.1.3-SNAPSHOT
[INFO] ------------------------------------------------------------------------
[INFO] 
[INFO] --- maven-clean-plugin:3.1.0:clean (default-clean) @ juneau-examples-rest ---
[INFO] Deleting <https://builds.apache.org/job/Juneau-Java-1.8/ws/juneau-examples/juneau-examples-rest/target>
[INFO] 
[INFO] --- maven-enforcer-plugin:1.4.1:enforce (enforce-maven-version) @ juneau-examples-rest
---
[INFO] 
[INFO] --- maven-enforcer-plugin:1.4.1:enforce (enforce-maven) @ juneau-examples-rest ---
[INFO] 
[INFO] --- maven-remote-resources-plugin:1.5:process (process-resource-bundles) @ juneau-examples-rest
---
[INFO] 
[INFO] --- maven-resources-plugin:3.1.0:resources (default-resources) @ juneau-examples-rest
---
[INFO] Using 'UTF-8' encoding to copy filtered resources.
[INFO] Copying 20 resources
[INFO] Copying 3 resources
[INFO] 
[INFO] --- maven-compiler-plugin:3.7.0:compile (default-compile) @ juneau-examples-rest ---
[INFO] Changes detected - recompiling the module!
[INFO] Compiling 11 source files to <https://builds.apache.org/job/Juneau-Java-1.8/ws/juneau-examples/juneau-examples-rest/target/classes>
[INFO] -------------------------------------------------------------
[ERROR] COMPILATION ERROR : 
[INFO] -------------------------------------------------------------
[ERROR] <https://builds.apache.org/job/Juneau-Java-1.8/ws/juneau-examples/juneau-examples-rest/src/main/java/org/apache/juneau/examples/rest/HelloWorldResource.java>:[42,8]
org.apache.juneau.examples.rest.HelloWorldResource is not abstract and does not override abstract
method error() in org.apache.juneau.rest.BasicRestConfig
[INFO] 1 error
[INFO] -------------------------------------------------------------
[INFO]                                                                         
[INFO] ------------------------------------------------------------------------
[INFO] Skipping juneau
[INFO] This project has been banned from the build due to previous failures.
[INFO] ------------------------------------------------------------------------
[INFO] ------------------------------------------------------------------------
[INFO] Reactor Summary:
[INFO] 
[INFO] juneau ............................................. SUCCESS [  7.496 s]
[INFO] juneau/core ........................................ SUCCESS [  4.162 s]
[INFO] juneau/core/marshall ............................... SUCCESS [01:00 min]
[INFO] juneau/core/marshall-rdf ........................... SUCCESS [ 12.478 s]
[INFO] juneau/core/dto .................................... SUCCESS [ 15.807 s]
[INFO] juneau/core/config ................................. SUCCESS [ 11.652 s]
[INFO] juneau/core/core-utest ............................. SUCCESS [01:05 min]
[INFO] juneau/rest ........................................ SUCCESS [  4.641 s]
[INFO] juneau/rest/rest-server ............................ SUCCESS [ 24.705 s]
[INFO] juneau/rest/rest-server-jaxrs ...................... SUCCESS [ 10.313 s]
[INFO] juneau/rest/rest-server-rdf ........................ SUCCESS [ 15.091 s]
[INFO] juneau/rest/rest-server-springboot ................. SUCCESS [ 12.941 s]
[INFO] juneau/rest/rest-client ............................ SUCCESS [ 11.874 s]
[INFO] juneau/rest/rest-mock .............................. SUCCESS [ 10.753 s]
[INFO] juneau/rest/rest-mock-utest ........................ SUCCESS [ 15.659 s]
[INFO] juneau/rest/rest-server-utest ...................... SUCCESS [ 39.487 s]
[INFO] juneau/rest/rest-client-utest ...................... SUCCESS [ 12.802 s]
[INFO] juneau/microservice ................................ SUCCESS [  4.102 s]
[INFO] juneau/microservice/microservice-core .............. SUCCESS [ 10.734 s]
[INFO] juneau/microservice/microservice-jetty ............. SUCCESS [  9.906 s]
[INFO] juneau/microservice/my-jetty-microservice .......... SUCCESS [ 11.125 s]
[INFO] juneau/examples .................................... SUCCESS [  4.058 s]
[INFO] juneau/examples/rest ............................... FAILURE [  0.499 s]
[INFO] juneau/microservice/microservice-ftest ............. SKIPPED
[INFO] juneau/microservice/my-springboot-microservice ..... SKIPPED
[INFO] juneau/sc .......................................... SKIPPED
[INFO] juneau/sc/sc-server ................................ SKIPPED
[INFO] juneau/sc/sc-client ................................ SKIPPED
[INFO] juneau/examples/examples-core ...................... SKIPPED
[INFO] juneau/examples/examples-rest-jetty ................ SKIPPED
[INFO] juneau/examples/examples-rest-springboot ........... SKIPPED
[INFO] juneau/examples/examples-rest-jetty-ftest .......... SKIPPED
[INFO] juneau/doc ......................................... SKIPPED
[INFO] juneau/releng ...................................... SKIPPED
[INFO] juneau/releng/all .................................. SKIPPED
[INFO] juneau/releng/distrib .............................. SKIPPED
[INFO] ------------------------------------------------------------------------
[INFO] BUILD FAILURE
[INFO] ------------------------------------------------------------------------
[INFO] Total time: 06:18 min
[INFO] Finished at: 2020-01-02T19:14:39+00:00
[INFO] Final Memory: 135M/3336M
[INFO] ------------------------------------------------------------------------
[ERROR] Failed to execute goal org.apache.maven.plugins:maven-compiler-plugin:3.7.0:compile
(default-compile) on project juneau-examples-rest: Compilation failure
[ERROR] <https://builds.apache.org/job/Juneau-Java-1.8/ws/juneau-examples/juneau-examples-rest/src/main/java/org/apache/juneau/examples/rest/HelloWorldResource.java>:[42,8]
org.apache.juneau.examples.rest.HelloWorldResource is not abstract and does not override abstract
method error() in org.apache.juneau.rest.BasicRestConfig
[ERROR] -> [Help 1]
[ERROR] 
[ERROR] To see the full stack trace of the errors, re-run Maven with the -e switch.
[ERROR] Re-run Maven using the -X switch to enable full debug logging.
[ERROR] 
[ERROR] For more information about the errors and possible solutions, please read the following
articles:
[ERROR] [Help 1] http://cwiki.apache.org/confluence/display/MAVEN/MojoFailureException
[ERROR] 
[ERROR] After correcting the problems, you can resume the build with the command
[ERROR]   mvn <goals> -rf :juneau-examples-rest
Build step 'Invoke top-level Maven targets' marked build as failure
Recording test results
[TASKS] Skipping publisher since build result is FAILURE

Mime
View raw message