juneau-dev mailing list archives

Site index · List index
Message view « Date » · « Thread »
Top « Date » · « Thread »
From Apache Jenkins Server <jenk...@builds.apache.org>
Subject Build failed in Jenkins: Juneau-Java-1.8 #1440
Date Sun, 08 Sep 2019 15:33:45 GMT
See <https://builds.apache.org/job/Juneau-Java-1.8/1440/display/redirect?page=changes>

Changes:

[JamesBognar] JUNEAU-142, JUNEAU-143

------------------------------------------
[...truncated 446.72 KB...]
[INFO] Running org.apache.juneau.rest.annotation2.QueryAnnotationTest
[INFO] Tests run: 35, Failures: 0, Errors: 0, Skipped: 0, Time elapsed: 0.188 s - in org.apache.juneau.rest.annotation2.QueryAnnotationTest
[INFO] Running org.apache.juneau.rest.annotation2.AnnotationInheritanceTest
[INFO] Tests run: 3, Failures: 0, Errors: 0, Skipped: 0, Time elapsed: 0.013 s - in org.apache.juneau.rest.annotation2.AnnotationInheritanceTest
[INFO] Running org.apache.juneau.rest.annotation2.FormDataAnnotationTest
[INFO] Tests run: 31, Failures: 0, Errors: 0, Skipped: 0, Time elapsed: 0.159 s - in org.apache.juneau.rest.annotation2.FormDataAnnotationTest
[INFO] Running org.apache.juneau.rest.annotation2.PathAnnotationTest
[INFO] Tests run: 101, Failures: 0, Errors: 0, Skipped: 0, Time elapsed: 0.308 s - in org.apache.juneau.rest.annotation2.PathAnnotationTest
[INFO] Running org.apache.juneau.rest.annotation2.RestResourcePojoSwapsTest
[INFO] Tests run: 2, Failures: 0, Errors: 0, Skipped: 0, Time elapsed: 0.033 s - in org.apache.juneau.rest.annotation2.RestResourcePojoSwapsTest
[INFO] Running org.apache.juneau.rest.annotation2.RoleGuardTest
[INFO] Tests run: 75, Failures: 0, Errors: 0, Skipped: 0, Time elapsed: 0.392 s - in org.apache.juneau.rest.annotation2.RoleGuardTest
[INFO] Running org.apache.juneau.rest.annotation2.HasQueryAnnotationTest
[INFO] Tests run: 2, Failures: 0, Errors: 0, Skipped: 0, Time elapsed: 0.012 s - in org.apache.juneau.rest.annotation2.HasQueryAnnotationTest
[INFO] Running org.apache.juneau.rest.annotation2.RestMethodInheritTest
[INFO] Tests run: 13, Failures: 0, Errors: 0, Skipped: 0, Time elapsed: 0.079 s - in org.apache.juneau.rest.annotation2.RestMethodInheritTest
[INFO] Running org.apache.juneau.rest.annotation2.RestResourceParsersTest
[INFO] Tests run: 5, Failures: 0, Errors: 0, Skipped: 0, Time elapsed: 0.017 s - in org.apache.juneau.rest.annotation2.RestResourceParsersTest
[INFO] Running org.apache.juneau.rest.annotation2.HasFormDataAnnotationTest
[INFO] Tests run: 1, Failures: 0, Errors: 0, Skipped: 0, Time elapsed: 0.01 s - in org.apache.juneau.rest.annotation2.HasFormDataAnnotationTest
[INFO] Running org.apache.juneau.rest.annotation2.PathRemainderAnnotationTest
[INFO] Tests run: 7, Failures: 0, Errors: 0, Skipped: 0, Time elapsed: 0.019 s - in org.apache.juneau.rest.annotation2.PathRemainderAnnotationTest
[INFO] Running org.apache.juneau.rest.annotation2.ResponseAnnotationTest
[INFO] Tests run: 68, Failures: 0, Errors: 0, Skipped: 0, Time elapsed: 0.239 s - in org.apache.juneau.rest.annotation2.ResponseAnnotationTest
[INFO] Running org.apache.juneau.rest.StatusCodesTest
[INFO] Tests run: 13, Failures: 0, Errors: 0, Skipped: 0, Time elapsed: 0.034 s - in org.apache.juneau.rest.StatusCodesTest
[INFO] Running org.apache.juneau.rest.RestParamsTest
[INFO] Tests run: 20, Failures: 0, Errors: 0, Skipped: 0, Time elapsed: 0.036 s - in org.apache.juneau.rest.RestParamsTest
[INFO] Running org.apache.juneau.rest.BasicRestCallLoggerTest
[INFO] Tests run: 32, Failures: 0, Errors: 0, Skipped: 0, Time elapsed: 0.011 s - in org.apache.juneau.rest.BasicRestCallLoggerTest
[INFO] Running org.apache.juneau.rest.NlsTest
[INFO] Tests run: 4, Failures: 0, Errors: 0, Skipped: 0, Time elapsed: 0.04 s - in org.apache.juneau.rest.NlsTest
[INFO] Running org.apache.juneau.rest.guard.RoleMatcherTest
[INFO] Tests run: 153, Failures: 0, Errors: 0, Skipped: 0, Time elapsed: 0.03 s - in org.apache.juneau.rest.guard.RoleMatcherTest
[INFO] Running org.apache.juneau.rest.ThreadLocalObjectsTest
[INFO] Tests run: 2, Failures: 0, Errors: 0, Skipped: 0, Time elapsed: 0.192 s - in org.apache.juneau.rest.ThreadLocalObjectsTest
[INFO] Running org.apache.juneau.rest.responses.BasicTest
[INFO] Tests run: 71, Failures: 0, Errors: 0, Skipped: 0, Time elapsed: 0.112 s - in org.apache.juneau.rest.responses.BasicTest
[INFO] Running org.apache.juneau.rest.mock2.MockServletRequestTest
[INFO] Tests run: 7, Failures: 0, Errors: 0, Skipped: 0, Time elapsed: 0.001 s - in org.apache.juneau.rest.mock2.MockServletRequestTest
[INFO] Running org.apache.juneau.rest.BeanContextPropertiesTest
[INFO] Tests run: 1, Failures: 0, Errors: 0, Skipped: 0, Time elapsed: 0.027 s - in org.apache.juneau.rest.BeanContextPropertiesTest
[INFO] Running org.apache.juneau.rest.BasicRestInfoProviderTest
[INFO] Tests run: 157, Failures: 0, Errors: 0, Skipped: 0, Time elapsed: 1.522 s - in org.apache.juneau.rest.BasicRestInfoProviderTest
[INFO] Running org.apache.juneau.rest.headers.ContentTypeTest
[INFO] Tests run: 9, Failures: 0, Errors: 0, Skipped: 0, Time elapsed: 0.033 s - in org.apache.juneau.rest.headers.ContentTypeTest
[INFO] Running org.apache.juneau.rest.headers.ClientVersionTest
[INFO] Tests run: 2, Failures: 0, Errors: 0, Skipped: 0, Time elapsed: 0.024 s - in org.apache.juneau.rest.headers.ClientVersionTest
[INFO] Running org.apache.juneau.rest.headers.AcceptEncodingTest
[INFO] Tests run: 12, Failures: 0, Errors: 0, Skipped: 0, Time elapsed: 0.034 s - in org.apache.juneau.rest.headers.AcceptEncodingTest
[INFO] Running org.apache.juneau.rest.headers.AcceptCharsetTest
[INFO] Tests run: 2, Failures: 0, Errors: 0, Skipped: 0, Time elapsed: 0.029 s - in org.apache.juneau.rest.headers.AcceptCharsetTest
[INFO] Running org.apache.juneau.rest.headers.HeadersTest
[INFO] Tests run: 104, Failures: 0, Errors: 0, Skipped: 0, Time elapsed: 2.428 s - in org.apache.juneau.rest.headers.HeadersTest
[INFO] Running org.apache.juneau.rest.headers.AcceptTest
[INFO] Tests run: 11, Failures: 0, Errors: 0, Skipped: 0, Time elapsed: 0.024 s - in org.apache.juneau.rest.headers.AcceptTest
[INFO] Running org.apache.juneau.rest.headers.ContentEncodingTest
[WARNING] Tests run: 4, Failures: 0, Errors: 0, Skipped: 1, Time elapsed: 0.008 s - in org.apache.juneau.rest.headers.ContentEncodingTest
[INFO] Running org.apache.juneau.rest.util.UrlPathPatternTest
[INFO] Tests run: 37, Failures: 0, Errors: 0, Skipped: 0, Time elapsed: 0.016 s - in org.apache.juneau.rest.util.UrlPathPatternTest
[INFO] Running org.apache.juneau.rest.util.RestUtilsTest
[INFO] Tests run: 13, Failures: 0, Errors: 0, Skipped: 0, Time elapsed: 0.002 s - in org.apache.juneau.rest.util.RestUtilsTest
[INFO] Running org.apache.juneau.rest.annotation.HtmlDocConfigScriptTest
[INFO] Tests run: 10, Failures: 0, Errors: 0, Skipped: 0, Time elapsed: 0.052 s - in org.apache.juneau.rest.annotation.HtmlDocConfigScriptTest
[INFO] Running org.apache.juneau.rest.annotation.RestResourceLoggingTest
[INFO] Tests run: 54, Failures: 0, Errors: 0, Skipped: 0, Time elapsed: 0.118 s - in org.apache.juneau.rest.annotation.RestResourceLoggingTest
[INFO] Running org.apache.juneau.rest.annotation.RestResourceMessagesTest
[INFO] Tests run: 2, Failures: 0, Errors: 0, Skipped: 0, Time elapsed: 0.007 s - in org.apache.juneau.rest.annotation.RestResourceMessagesTest
[INFO] Running org.apache.juneau.rest.annotation.RestMethodMatchersTest
[INFO] Tests run: 2, Failures: 0, Errors: 0, Skipped: 0, Time elapsed: 0.005 s - in org.apache.juneau.rest.annotation.RestMethodMatchersTest
[INFO] Running org.apache.juneau.rest.annotation.HtmlDocFooterTest
[INFO] Tests run: 10, Failures: 0, Errors: 0, Skipped: 0, Time elapsed: 0.044 s - in org.apache.juneau.rest.annotation.HtmlDocFooterTest
[INFO] Running org.apache.juneau.rest.annotation.ResponseStatusAnnotationTest
[INFO] Tests run: 1, Failures: 0, Errors: 0, Skipped: 0, Time elapsed: 0.003 s - in org.apache.juneau.rest.annotation.ResponseStatusAnnotationTest
[INFO] Running org.apache.juneau.rest.annotation.RestResourcePropertiesTest
[INFO] Tests run: 1, Failures: 0, Errors: 0, Skipped: 0, Time elapsed: 0.004 s - in org.apache.juneau.rest.annotation.RestResourcePropertiesTest
[INFO] Running org.apache.juneau.rest.annotation.HtmlDocAsideTest
[INFO] Tests run: 10, Failures: 0, Errors: 0, Skipped: 0, Time elapsed: 0.038 s - in org.apache.juneau.rest.annotation.HtmlDocAsideTest
[INFO] Running org.apache.juneau.rest.annotation.RestMethodGuardsTest
[INFO] Tests run: 2, Failures: 0, Errors: 0, Skipped: 0, Time elapsed: 0.004 s - in org.apache.juneau.rest.annotation.RestMethodGuardsTest
[INFO] Running org.apache.juneau.rest.annotation.HtmlDocNavlinksTest
[INFO] Tests run: 22, Failures: 0, Errors: 0, Skipped: 0, Time elapsed: 0.066 s - in org.apache.juneau.rest.annotation.HtmlDocNavlinksTest
[INFO] Running org.apache.juneau.rest.annotation.RestResourceTest
[INFO] Tests run: 31, Failures: 0, Errors: 0, Skipped: 0, Time elapsed: 0.083 s - in org.apache.juneau.rest.annotation.RestResourceTest
[INFO] Running org.apache.juneau.rest.annotation.HtmlDocConfigNavlinksTest
[INFO] Tests run: 22, Failures: 0, Errors: 0, Skipped: 0, Time elapsed: 0.06 s - in org.apache.juneau.rest.annotation.HtmlDocConfigNavlinksTest
[INFO] Running org.apache.juneau.rest.annotation.HtmlDocStyleTest
[INFO] Tests run: 10, Failures: 0, Errors: 0, Skipped: 0, Time elapsed: 0.038 s - in org.apache.juneau.rest.annotation.HtmlDocStyleTest
[INFO] Running org.apache.juneau.rest.annotation.RestResourceStaticFilesTest
Response did not have the expected substring.
	Expected=[OK-3]
	Body=[ ***************************************************************************************************************************
 * Licensed to the Apache Software Foundation (ASF) under one or more contributor license
agreements.  See the NOTICE file *
 * distributed with this work for additional information regarding copyright ownership.  The
ASF licenses this file        *
 * to you under the Apache License, Version 2.0 (the "License"); you may not use this file
except in compliance            *
 * with the License.  You may obtain a copy of the License at                            
                                 *
 *                                                                                       
                                 *
 *  http://www.apache.org/licenses/LICENSE-2.0                                           
                                 *
 *                                                                                       
                                 *
 * Unless required by applicable law or agreed to in writing, software distributed under the
License is distributed on an  *
 * "AS IS" BASIS, WITHOUT WARRANTIES OR CONDITIONS OF ANY KIND, either express or implied.
 See the License for the        *
 * specific language governing permissions and limitations under the License.            
                                 *
 ***************************************************************************************************************************
 OK-1]
[ERROR] Tests run: 4, Failures: 1, Errors: 0, Skipped: 0, Time elapsed: 0.022 s <<<
FAILURE! - in org.apache.juneau.rest.annotation.RestResourceStaticFilesTest
[ERROR] c01(org.apache.juneau.rest.annotation.RestResourceStaticFilesTest)  Time elapsed:
0.009 s  <<< FAILURE!
org.apache.juneau.rest.mock2.MockServletResponse$MockAssertionError: 
Response did not have the expected substring.
	Expected=[OK-3]
	Body=[ ***************************************************************************************************************************
 * Licensed to the Apache Software Foundation (ASF) under one or more contributor license
agreements.  See the NOTICE file *
 * distributed with this work for additional information regarding copyright ownership.  The
ASF licenses this file        *
 * to you under the Apache License, Version 2.0 (the "License"); you may not use this file
except in compliance            *
 * with the License.  You may obtain a copy of the License at                            
                                 *
 *                                                                                       
                                 *
 *  http://www.apache.org/licenses/LICENSE-2.0                                           
                                 *
 *                                                                                       
                                 *
 * Unless required by applicable law or agreed to in writing, software distributed under the
License is distributed on an  *
 * "AS IS" BASIS, WITHOUT WARRANTIES OR CONDITIONS OF ANY KIND, either express or implied.
 See the License for the        *
 * specific language governing permissions and limitations under the License.            
                                 *
 ***************************************************************************************************************************
 OK-1]
	at org.apache.juneau.rest.annotation.RestResourceStaticFilesTest.c01(RestResourceStaticFilesTest.java:98)

[INFO] Running org.apache.juneau.rest.annotation.RestResourcePathTest
[INFO] Tests run: 1, Failures: 0, Errors: 0, Skipped: 0, Time elapsed: 0.003 s - in org.apache.juneau.rest.annotation.RestResourcePathTest
[INFO] Running org.apache.juneau.rest.annotation.ResponseHeaderAnnotationTest
[INFO] Tests run: 17, Failures: 0, Errors: 0, Skipped: 0, Time elapsed: 0.03 s - in org.apache.juneau.rest.annotation.ResponseHeaderAnnotationTest
[INFO] Running org.apache.juneau.rest.annotation.HtmlDocNavTest
[INFO] Tests run: 10, Failures: 0, Errors: 0, Skipped: 0, Time elapsed: 0.04 s - in org.apache.juneau.rest.annotation.HtmlDocNavTest
[INFO] Running org.apache.juneau.rest.annotation.HtmlDocConfigStyleTest
[INFO] Tests run: 10, Failures: 0, Errors: 0, Skipped: 0, Time elapsed: 0.035 s - in org.apache.juneau.rest.annotation.HtmlDocConfigStyleTest
[INFO] Running org.apache.juneau.rest.annotation.HtmlDocConfigAsideTest
[INFO] Tests run: 10, Failures: 0, Errors: 0, Skipped: 0, Time elapsed: 0.036 s - in org.apache.juneau.rest.annotation.HtmlDocConfigAsideTest
[INFO] Running org.apache.juneau.rest.annotation.RestMethodBpiTest
[INFO] Tests run: 16, Failures: 0, Errors: 0, Skipped: 0, Time elapsed: 0.161 s - in org.apache.juneau.rest.annotation.RestMethodBpiTest
[INFO] Running org.apache.juneau.rest.annotation.RestResourceSerializersTest
[INFO] Tests run: 5, Failures: 0, Errors: 0, Skipped: 0, Time elapsed: 0.009 s - in org.apache.juneau.rest.annotation.RestResourceSerializersTest
[INFO] Running org.apache.juneau.rest.annotation.HtmlDocConfigHeaderTest
[INFO] Tests run: 10, Failures: 0, Errors: 0, Skipped: 0, Time elapsed: 0.033 s - in org.apache.juneau.rest.annotation.HtmlDocConfigHeaderTest
[INFO] Running org.apache.juneau.rest.annotation.HtmlDocConfigFooterTest
[INFO] Tests run: 10, Failures: 0, Errors: 0, Skipped: 0, Time elapsed: 0.034 s - in org.apache.juneau.rest.annotation.HtmlDocConfigFooterTest
[INFO] Running org.apache.juneau.rest.annotation.RestMethodPathTest
[INFO] Tests run: 1, Failures: 0, Errors: 0, Skipped: 0, Time elapsed: 0.005 s - in org.apache.juneau.rest.annotation.RestMethodPathTest
[INFO] Running org.apache.juneau.rest.annotation.HtmlDocScriptTest
[INFO] Tests run: 10, Failures: 0, Errors: 0, Skipped: 0, Time elapsed: 0.033 s - in org.apache.juneau.rest.annotation.HtmlDocScriptTest
[INFO] Running org.apache.juneau.rest.annotation.HtmlDocHeaderTest
[INFO] Tests run: 10, Failures: 0, Errors: 0, Skipped: 0, Time elapsed: 0.029 s - in org.apache.juneau.rest.annotation.HtmlDocHeaderTest
[INFO] Running org.apache.juneau.rest.annotation.HtmlDocConfigNavTest
[INFO] Tests run: 10, Failures: 0, Errors: 0, Skipped: 0, Time elapsed: 0.036 s - in org.apache.juneau.rest.annotation.HtmlDocConfigNavTest
[INFO] Running org.apache.juneau.rest.exceptions.BasicTest
[INFO] Tests run: 167, Failures: 0, Errors: 0, Skipped: 0, Time elapsed: 0.168 s - in org.apache.juneau.rest.exceptions.BasicTest
[INFO] Running org.apache.juneau.rest.RestCallLoggerConfigTest
[INFO] Tests run: 21, Failures: 0, Errors: 0, Skipped: 0, Time elapsed: 0 s - in org.apache.juneau.rest.RestCallLoggerConfigTest
[INFO] 
[INFO] Results:
[INFO] 
[ERROR] Failures: 
[ERROR]   RestResourceStaticFilesTest.c01:98 Response did not have the expected substring.
	Expected=[OK-3]
	Body=[ ***************************************************************************************************************************
 * Licensed to the Apache Software Foundation (ASF) under one or more contributor license
agreements.  See the NOTICE file *
 * distributed with this work for additional information regarding copyright ownership.  The
ASF licenses this file        *
 * to you under the Apache License, Version 2.0 (the "License"); you may not use this file
except in compliance            *
 * with the License.  You may obtain a copy of the License at                            
                                 *
 *                                                                                       
                                 *
 *  http://www.apache.org/licenses/LICENSE-2.0                                           
                                 *
 *                                                                                       
                                 *
 * Unless required by applicable law or agreed to in writing, software distributed under the
License is distributed on an  *
 * "AS IS" BASIS, WITHOUT WARRANTIES OR CONDITIONS OF ANY KIND, either express or implied.
 See the License for the        *
 * specific language governing permissions and limitations under the License.            
                                 *
 ***************************************************************************************************************************
 OK-1]
[INFO] 
[ERROR] Tests run: 1712, Failures: 1, Errors: 0, Skipped: 1
[INFO] 
[INFO]                                                                         
[INFO] ------------------------------------------------------------------------
[INFO] Skipping Apache Juneau
[INFO] This project has been banned from the build due to previous failures.
[INFO] ------------------------------------------------------------------------
[INFO] ------------------------------------------------------------------------
[INFO] Reactor Summary:
[INFO] 
[INFO] Apache Juneau ...................................... SUCCESS [  7.480 s]
[INFO] Apache Juneau - Core APIs .......................... SUCCESS [  4.504 s]
[INFO] Apache Juneau Marshall ............................. SUCCESS [ 43.617 s]
[INFO] Apache Juneau Marshal RDF .......................... SUCCESS [ 12.104 s]
[INFO] Apache Juneau Data Transfer Objects ................ SUCCESS [ 14.459 s]
[INFO] Apache Juneau Core ................................. SUCCESS [  9.649 s]
[INFO] Apache Juneau Config File API ...................... SUCCESS [ 10.547 s]
[INFO] Apache Juneau Core (Unit Tests) .................... SUCCESS [ 48.760 s]
[INFO] Apache Juneau - REST APIs .......................... SUCCESS [  4.240 s]
[INFO] Apache Juneau REST Servlet API ..................... SUCCESS [ 20.210 s]
[INFO] Apache Juneau REST JAX/RS API ...................... SUCCESS [  9.859 s]
[INFO] Apache Juneau REST Servlet API, RDF support ........ SUCCESS [ 14.129 s]
[INFO] Apache Juneau REST Spring Boot Integration ......... SUCCESS [ 13.224 s]
[INFO] Apache Juneau REST Client API ...................... SUCCESS [ 11.116 s]
[INFO] Apache Juneau REST Mock API ........................ SUCCESS [ 10.117 s]
[INFO] Apache Juneau REST Mock API (Unit Tests) ........... SUCCESS [ 13.545 s]
[INFO] Apache Juneau REST Servlet API (Unit Tests) ........ FAILURE [ 12.946 s]
[INFO] Apache Juneau REST Client API (Unit Tests) ......... SKIPPED
[INFO] Apache Juneau - Microservice APIs .................. SKIPPED
[INFO] Apache Juneau Microservice Core Library ............ SKIPPED
[INFO] Apache Juneau Microservice Server .................. SKIPPED
[INFO] Apache Juneau Jetty Microservice Template .......... SKIPPED
[INFO] Apache Juneau - Examples ........................... SKIPPED
[INFO] Apache Juneau REST Examples ........................ SKIPPED
[INFO] Apache Juneau Microservice (Function Tests) ........ SKIPPED
[INFO] Apache Juneau Spring Boot Microservice Template .... SKIPPED
[INFO] Apache Juneau Core Examples ........................ SKIPPED
[INFO] Apache Juneau REST Examples using Jetty ............ SKIPPED
[INFO] Apache Juneau REST Examples using Spring Boot ...... SKIPPED
[INFO] Apache Juneau REST Examples (Function Tests) ....... SKIPPED
[INFO] Apache Juneau Petstore Example ..................... SKIPPED
[INFO] Apache Juneau Petstore Example - Common API ........ SKIPPED
[INFO] Apache Juneau Petstore Example - Server Code ....... SKIPPED
[INFO] Apache Juneau Petstore Example - Client Code ....... SKIPPED
[INFO] Apache Juneau Javadocs ............................. SKIPPED
[INFO] Apache Juneau - Release Engineering ................ SKIPPED
[INFO] Apache Juneau UberJar .............................. SKIPPED
[INFO] Apache Juneau Distribution ......................... SKIPPED
[INFO] Apache Juneau - Configuration Server ............... SKIPPED
[INFO] Apache Juneau Configuration Server API ............. SKIPPED
[INFO] Apache Juneau Configuration Server - Client API .... SKIPPED
[INFO] ------------------------------------------------------------------------
[INFO] BUILD FAILURE
[INFO] ------------------------------------------------------------------------
[INFO] Total time: 04:22 min
[INFO] Finished at: 2019-09-08T15:33:11+00:00
[INFO] Final Memory: 103M/2758M
[INFO] ------------------------------------------------------------------------
[ERROR] Failed to execute goal org.apache.maven.plugins:maven-surefire-plugin:2.22.0:test
(default-test) on project juneau-rest-server-utest: There are test failures.
[ERROR] 
[ERROR] Please refer to <https://builds.apache.org/job/Juneau-Java-1.8/ws/juneau-rest/juneau-rest-server-utest/target/surefire-reports>
for the individual test results.
[ERROR] Please refer to dump files (if any exist) [date]-jvmRun[N].dump, [date].dumpstream
and [date]-jvmRun[N].dumpstream.
[ERROR] -> [Help 1]
[ERROR] 
[ERROR] To see the full stack trace of the errors, re-run Maven with the -e switch.
[ERROR] Re-run Maven using the -X switch to enable full debug logging.
[ERROR] 
[ERROR] For more information about the errors and possible solutions, please read the following
articles:
[ERROR] [Help 1] http://cwiki.apache.org/confluence/display/MAVEN/MojoFailureException
[ERROR] 
[ERROR] After correcting the problems, you can resume the build with the command
[ERROR]   mvn <goals> -rf :juneau-rest-server-utest
Build step 'Invoke top-level Maven targets' marked build as failure
Recording test results
[TASKS] Skipping publisher since build result is FAILURE

Mime
View raw message