juneau-dev mailing list archives

Site index · List index
Message view « Date » · « Thread »
Top « Date » · « Thread »
From "James Bognar (JIRA)" <j...@apache.org>
Subject [jira] [Resolved] (JUNEAU-129) LocalizedDatesTest failures during build
Date Tue, 06 Aug 2019 16:45:00 GMT

     [ https://issues.apache.org/jira/browse/JUNEAU-129?page=com.atlassian.jira.plugin.system.issuetabpanels:all-tabpanel
]

James Bognar resolved JUNEAU-129.
---------------------------------
       Resolution: Fixed
         Assignee: James Bognar
    Fix Version/s: 8.0.1

> LocalizedDatesTest failures during build
> ----------------------------------------
>
>                 Key: JUNEAU-129
>                 URL: https://issues.apache.org/jira/browse/JUNEAU-129
>             Project: Juneau
>          Issue Type: Bug
>          Components: Code
>    Affects Versions: 8.0.1
>            Reporter: Stian Soiland-Reyes
>            Assignee: James Bognar
>            Priority: Major
>             Fix For: 8.0.1
>
>          Time Spent: 20m
>  Remaining Estimate: 0h
>
> {{[ERROR]   LocalizedDatesTest.test:655 expected:<Saturday, [March 3,] 2001>
but was:<Saturday, [3 March] 2001>}}
>  {{[ERROR]   LocalizedDatesTest.test:655 expected:<[March 3,] 2001> but was:<[03
March] 2001>}}
>  {{[ERROR]   LocalizedDatesTest.test:655 expected:<[Mar 3, ]2001> but was:<[03-Mar-]2001>}}
>  {{[ERROR]   LocalizedDatesTest.test:655 expected:<[3/]3/01> but was:<[03/0]3/01>}}
>  {{[ERROR]   LocalizedDatesTest.test:655 expected:<10:11:12 [AM] GMT> but was:<10:11:12
[o'clock] GMT>}}
>  {{[ERROR]   LocalizedDatesTest.test:655 expected:<10:11:12 [AM ]GMT> but was:<10:11:12
[]GMT>}}
>  {{[ERROR]   LocalizedDatesTest.test:655 expected:<10:11:12[ AM]> but was:<10:11:12[]>}}
>  {{[ERROR]   LocalizedDatesTest.test:655 expected:<10:11[ AM]> but was:<10:11[]>}}
>  {{[ERROR]   LocalizedDatesTest.test:655 expected:<Saturday, [March 3, 2001 10:11:12
AM] GMT> but was:<Saturday, [3 March 2001 10:11:12 o'clock] GMT>}}
>  {{[ERROR]   LocalizedDatesTest.test:655 expected:<[March 3, 2001 10:11:12 AM] GMT>
but was:<[03 March 2001 10:11:12] GMT>}}
>  {{[ERROR]   LocalizedDatesTest.test:655 expected:<[Mar 3, 2001 10:11:12 AM]>
but was:<[03-Mar-2001 10:11:12]>}}
>  {{[ERROR]   LocalizedDatesTest.test:655 expected:<[3/3/01 10:11 AM]> but was:<[03/03/01
10:11]>}}
>  {{[ERROR]   LocalizedDatesTest.test:655 expected:<Saturday, [March 3,] 2001>
but was:<Saturday, [3 March] 2001>}}
>  {{[ERROR]   LocalizedDatesTest.test:655 expected:<[March 3,] 2001> but was:<[03
March] 2001>}}
>  {{[ERROR]   LocalizedDatesTest.test:655 expected:<[Mar 3, ]2001> but was:<[03-Mar-]2001>}}
>  {{[ERROR]   LocalizedDatesTest.test:655 expected:<[3/]3/01> but was:<[03/0]3/01>}}
>  {{[ERROR]   LocalizedDatesTest.test:655 expected:<10:11:12 [AM] GMT> but was:<10:11:12
[o'clock] GMT>}}
>  {{[ERROR]   LocalizedDatesTest.test:655 expected:<10:11:12 [AM ]GMT> but was:<10:11:12
[]GMT>}}
>  {{[ERROR]   LocalizedDatesTest.test:655 expected:<10:11:12[ AM]> but was:<10:11:12[]>}}
>  {{[ERROR]   LocalizedDatesTest.test:655 expected:<10:11[ AM]> but was:<10:11[]>}}
>  {{[ERROR]   LocalizedDatesTest.test:655 expected:<Saturday, [March 3, 2001 10:11:12
AM] GMT> but was:<Saturday, [3 March 2001 10:11:12 o'clock] GMT>}}
>  {{[ERROR]   LocalizedDatesTest.test:655 expected:<[March 3, 2001 10:11:12 AM] GMT>
but was:<[03 March 2001 10:11:12] GMT>}}
>  {{[ERROR]   LocalizedDatesTest.test:655 expected:<[Mar 3, 2001 10:11:12 AM]>
but was:<[03-Mar-2001 10:11:12]>}}
>  {{[ERROR]   LocalizedDatesTest.test:655 expected:<[3/3/01 10:11 AM]> but was:<[03/03/01
10:11]>}}
>  {{[INFO] 
> ..
> {{[INFO] Apache Juneau Core (Unit Tests) .................... FAILURE [ 51.116 s]}}
> {{(base) stain@biggie:~/src/juneau$ mvn -v}}
>  {{Apache Maven 3.6.0 (97c98ec64a1fdfee7767ce5ffb20918da4f719f3; 2018-10-24T19:41:47+01:00)}}
>  {{Maven home: /home/stain/software/maven}}
>  {{Java version: 11.0.4, vendor: Ubuntu, runtime: /usr/lib/jvm/java-11-openjdk-amd64}}
>  {{Default locale: en_GB, platform encoding: UTF-8}}
>  {{OS name: "linux", version: "4.15.0-55-generic", arch: "amd64", family: "unix"}}



--
This message was sent by Atlassian JIRA
(v7.6.14#76016)

Mime
View raw message