juneau-dev mailing list archives

Site index · List index
Message view « Date » · « Thread »
Top « Date » · « Thread »
From Apache Jenkins Server <jenk...@builds.apache.org>
Subject Build failed in Jenkins: Juneau-Java-1.8 #1397
Date Mon, 22 Jul 2019 21:48:06 GMT
See <https://builds.apache.org/job/Juneau-Java-1.8/1397/display/redirect?page=changes>

Changes:

[JamesBognar] JUNEAU-101 Update handling of dates to use new Java 8 libraries.

------------------------------------------
[...truncated 216.28 KB...]
[ERROR] testSwap[17](org.apache.juneau.transforms.TemporalCalendarSwapTest)  Time elapsed:
0 s  <<< FAILURE!
java.lang.AssertionError: Test [[17] IsoOffsetDateTime, Pacific timezone swap] failed.  Expected=[2012-12-21T07:34:56-05:00],
Actual=[2012-12-21T12:34:56Z]

[ERROR] testSwap[18](org.apache.juneau.transforms.TemporalCalendarSwapTest)  Time elapsed:
0.001 s  <<< FAILURE!
java.lang.AssertionError: Test [[18] IsoOffsetTime, Default timezone swap] failed.  Expected=[07:34:56-05:00],
Actual=[12:34:56Z]

[ERROR] testSwap[19](org.apache.juneau.transforms.TemporalCalendarSwapTest)  Time elapsed:
0 s  <<< FAILURE!
java.lang.AssertionError: Test [[19] IsoOffsetTime, Pacific timezone swap] failed.  Expected=[07:34:56-05:00],
Actual=[12:34:56Z]

[ERROR] testSwap[20](org.apache.juneau.transforms.TemporalCalendarSwapTest)  Time elapsed:
0 s  <<< FAILURE!
java.lang.AssertionError: Test [[20] IsoOrdinalDate, Default timezone swap] failed.  Expected=[2012-356-05:00],
Actual=[2012-356Z]

[ERROR] testSwap[21](org.apache.juneau.transforms.TemporalCalendarSwapTest)  Time elapsed:
0 s  <<< FAILURE!
java.lang.AssertionError: Test [[21] IsoOrdinalDate, Pacific timezone swap] failed.  Expected=[2012-356-05:00],
Actual=[2012-356Z]

[ERROR] testSwap[22](org.apache.juneau.transforms.TemporalCalendarSwapTest)  Time elapsed:
0.001 s  <<< FAILURE!
java.lang.AssertionError: Test [[22] IsoTime, Default timezone swap] failed.  Expected=[07:34:56-05:00],
Actual=[12:34:56Z]

[ERROR] testSwap[23](org.apache.juneau.transforms.TemporalCalendarSwapTest)  Time elapsed:
0 s  <<< FAILURE!
java.lang.AssertionError: Test [[23] IsoTime, Pacific timezone swap] failed.  Expected=[07:34:56-05:00],
Actual=[12:34:56Z]

[ERROR] testSwap[24](org.apache.juneau.transforms.TemporalCalendarSwapTest)  Time elapsed:
0 s  <<< FAILURE!
java.lang.AssertionError: Test [[24] IsoWeekDate, Default timezone swap] failed.  Expected=[2012-W51-5-05:00],
Actual=[2012-W51-5Z]

[ERROR] testSwap[25](org.apache.juneau.transforms.TemporalCalendarSwapTest)  Time elapsed:
0 s  <<< FAILURE!
java.lang.AssertionError: Test [[25] IsoWeekDate, Pacific timezone swap] failed.  Expected=[2012-W51-5-05:00],
Actual=[2012-W51-5Z]

[ERROR] testSwap[26](org.apache.juneau.transforms.TemporalCalendarSwapTest)  Time elapsed:
0.001 s  <<< FAILURE!
java.lang.AssertionError: Test [[26] IsoZonedDateTime, Default timezone swap] failed.  Expected=[2012-12-21T07:34:56-05:00[America/New_York]],
Actual=[2012-12-21T12:34:56Z[Etc/UTC]]

[ERROR] testSwap[27](org.apache.juneau.transforms.TemporalCalendarSwapTest)  Time elapsed:
0.001 s  <<< FAILURE!
java.lang.AssertionError: Test [[27] IsoZonedDateTime, Pacific timezone swap] failed.  Expected=[2012-12-21T07:34:56-05:00[America/New_York]],
Actual=[2012-12-21T12:34:56Z[Etc/UTC]]

[ERROR] testSwap[28](org.apache.juneau.transforms.TemporalCalendarSwapTest)  Time elapsed:
0.001 s  <<< FAILURE!
java.lang.AssertionError: Test [[28] Rfc1123DateTime, Default timezone swap] failed.  Expected=[Fri,
21 Dec 2012 07:34:56 -0500], Actual=[Fri, 21 Dec 2012 12:34:56 GMT]

[ERROR] testSwap[29](org.apache.juneau.transforms.TemporalCalendarSwapTest)  Time elapsed:
0 s  <<< FAILURE!
java.lang.AssertionError: Test [[29] Rfc1123DateTime, Pacific timezone swap] failed.  Expected=[Fri,
21 Dec 2012 07:34:56 -0500], Actual=[Fri, 21 Dec 2012 12:34:56 GMT]

[INFO] Running org.apache.juneau.transforms.BeanFilterTest
[INFO] Tests run: 6, Failures: 0, Errors: 0, Skipped: 0, Time elapsed: 0.02 s - in org.apache.juneau.transforms.BeanFilterTest
[INFO] Running org.apache.juneau.transforms.BeanDictionaryComboTest
[INFO] Tests run: 1560, Failures: 0, Errors: 0, Skipped: 0, Time elapsed: 1.24 s - in org.apache.juneau.transforms.BeanDictionaryComboTest
[INFO] Running org.apache.juneau.transforms.ReaderSwapTest
[INFO] Tests run: 3, Failures: 0, Errors: 0, Skipped: 0, Time elapsed: 0 s - in org.apache.juneau.transforms.ReaderSwapTest
[INFO] Running org.apache.juneau.PojoExamplesTest
[INFO] Tests run: 9, Failures: 0, Errors: 0, Skipped: 0, Time elapsed: 0 s - in org.apache.juneau.PojoExamplesTest
[INFO] Running org.apache.juneau.utils.BeanDiffTest
[INFO] Tests run: 11, Failures: 0, Errors: 0, Skipped: 0, Time elapsed: 0 s - in org.apache.juneau.utils.BeanDiffTest
[INFO] Running org.apache.juneau.utils.ArrayUtilsTest
[INFO] Tests run: 9, Failures: 0, Errors: 0, Skipped: 0, Time elapsed: 0.004 s - in org.apache.juneau.utils.ArrayUtilsTest
[INFO] Running org.apache.juneau.utils.PojoMergeTest
[INFO] Tests run: 1, Failures: 0, Errors: 0, Skipped: 0, Time elapsed: 0.002 s - in org.apache.juneau.utils.PojoMergeTest
[INFO] Running org.apache.juneau.utils.UriContextResolutionComboTest
[INFO] Tests run: 720, Failures: 0, Errors: 0, Skipped: 0, Time elapsed: 0.185 s - in org.apache.juneau.utils.UriContextResolutionComboTest
[INFO] Running org.apache.juneau.utils.StringUtilsTest
[INFO] Tests run: 33, Failures: 0, Errors: 0, Skipped: 0, Time elapsed: 0.015 s - in org.apache.juneau.utils.StringUtilsTest
[INFO] Running org.apache.juneau.utils.HttpUtilsTest
[INFO] Tests run: 8, Failures: 0, Errors: 0, Skipped: 0, Time elapsed: 0.002 s - in org.apache.juneau.utils.HttpUtilsTest
[INFO] Running org.apache.juneau.utils.StringExpressionMatcherTest
[INFO] Tests run: 131, Failures: 0, Errors: 0, Skipped: 0, Time elapsed: 0.033 s - in org.apache.juneau.utils.StringExpressionMatcherTest
[INFO] Running org.apache.juneau.utils.SimpleMapTest
[INFO] Tests run: 1, Failures: 0, Errors: 0, Skipped: 0, Time elapsed: 0.007 s - in org.apache.juneau.utils.SimpleMapTest
[INFO] Running org.apache.juneau.utils.MultiIterableTest
[INFO] Tests run: 1, Failures: 0, Errors: 0, Skipped: 0, Time elapsed: 0.003 s - in org.apache.juneau.utils.MultiIterableTest
[INFO] Running org.apache.juneau.utils.TransformCacheTest
[INFO] Tests run: 13, Failures: 0, Errors: 0, Skipped: 0, Time elapsed: 0.009 s - in org.apache.juneau.utils.TransformCacheTest
[INFO] Running org.apache.juneau.utils.ByteArrayInOutStreamTest
[INFO] Tests run: 1, Failures: 0, Errors: 0, Skipped: 0, Time elapsed: 0.002 s - in org.apache.juneau.utils.ByteArrayInOutStreamTest
[INFO] Running org.apache.juneau.utils.StackTraceDatabaseTest
[INFO] Tests run: 2, Failures: 0, Errors: 0, Skipped: 0, Time elapsed: 0.002 s - in org.apache.juneau.utils.StackTraceDatabaseTest
[INFO] Running org.apache.juneau.utils.FilteredMapTest
[INFO] Tests run: 1, Failures: 0, Errors: 0, Skipped: 0, Time elapsed: 0.001 s - in org.apache.juneau.utils.FilteredMapTest
[INFO] Running org.apache.juneau.utils.PojoIntrospectorTest
[INFO] Tests run: 1, Failures: 0, Errors: 0, Skipped: 0, Time elapsed: 0 s - in org.apache.juneau.utils.PojoIntrospectorTest
[INFO] Running org.apache.juneau.utils.PojoQueryTest
[INFO] Tests run: 5, Failures: 0, Errors: 0, Skipped: 0, Time elapsed: 0.054 s - in org.apache.juneau.utils.PojoQueryTest
[INFO] Running org.apache.juneau.utils.UriContextUriComboTest
[INFO] Tests run: 70, Failures: 0, Errors: 0, Skipped: 0, Time elapsed: 0.005 s - in org.apache.juneau.utils.UriContextUriComboTest
[INFO] Running org.apache.juneau.utils.CollectionUtilsTest
[INFO] Tests run: 4, Failures: 0, Errors: 0, Skipped: 0, Time elapsed: 0.015 s - in org.apache.juneau.utils.CollectionUtilsTest
[INFO] Running org.apache.juneau.utils.KeywordStoreTest
[INFO] Tests run: 1, Failures: 0, Errors: 0, Skipped: 0, Time elapsed: 0 s - in org.apache.juneau.utils.KeywordStoreTest
[INFO] Running org.apache.juneau.utils.ParserReaderTest
[INFO] Tests run: 1, Failures: 0, Errors: 0, Skipped: 0, Time elapsed: 0 s - in org.apache.juneau.utils.ParserReaderTest
[INFO] Running org.apache.juneau.utils.ArgsTest
[INFO] Tests run: 1, Failures: 0, Errors: 0, Skipped: 0, Time elapsed: 0 s - in org.apache.juneau.utils.ArgsTest
[INFO] Running org.apache.juneau.utils.IOUtilsTest
[INFO] Tests run: 2, Failures: 0, Errors: 0, Skipped: 0, Time elapsed: 0.049 s - in org.apache.juneau.utils.IOUtilsTest
[INFO] Running org.apache.juneau.utils.StringBuilderWriterTest
[INFO] Tests run: 1, Failures: 0, Errors: 0, Skipped: 0, Time elapsed: 0 s - in org.apache.juneau.utils.StringBuilderWriterTest
[INFO] Running org.apache.juneau.utils.StringVarResolverTest
[INFO] Tests run: 7, Failures: 0, Errors: 0, Skipped: 0, Time elapsed: 0.007 s - in org.apache.juneau.utils.StringVarResolverTest
[INFO] Running org.apache.juneau.utils.MultiSetTest
[INFO] Tests run: 1, Failures: 0, Errors: 0, Skipped: 0, Time elapsed: 0.005 s - in org.apache.juneau.utils.MultiSetTest
[INFO] Running org.apache.juneau.utils.IOPipeTest
[INFO] Tests run: 5, Failures: 0, Errors: 0, Skipped: 0, Time elapsed: 0.004 s - in org.apache.juneau.utils.IOPipeTest
[INFO] Running org.apache.juneau.utils.ClassUtilsTest
[INFO] Tests run: 1, Failures: 0, Errors: 0, Skipped: 0, Time elapsed: 0.001 s - in org.apache.juneau.utils.ClassUtilsTest
[INFO] Running org.apache.juneau.utils.PojoRestTest
[INFO] Tests run: 10, Failures: 0, Errors: 0, Skipped: 0, Time elapsed: 0.072 s - in org.apache.juneau.utils.PojoRestTest
[INFO] Running org.apache.juneau.utils.CharSetTest
[INFO] Tests run: 1, Failures: 0, Errors: 0, Skipped: 0, Time elapsed: 0.001 s - in org.apache.juneau.utils.CharSetTest
[INFO] Running org.apache.juneau.json.JsonConfigAnnotationTest
[INFO] Tests run: 6, Failures: 0, Errors: 0, Skipped: 0, Time elapsed: 0.006 s - in org.apache.juneau.json.JsonConfigAnnotationTest
[INFO] Running org.apache.juneau.json.JsonParserTest
[INFO] Tests run: 9, Failures: 0, Errors: 0, Skipped: 0, Time elapsed: 0.009 s - in org.apache.juneau.json.JsonParserTest
[INFO] Running org.apache.juneau.json.JsonSchemaSerializerTest
[INFO] Tests run: 1, Failures: 0, Errors: 0, Skipped: 0, Time elapsed: 0.001 s - in org.apache.juneau.json.JsonSchemaSerializerTest
[INFO] Running org.apache.juneau.json.JsonParserEdgeCasesTest
[INFO] Tests run: 636, Failures: 0, Errors: 0, Skipped: 0, Time elapsed: 0.187 s - in org.apache.juneau.json.JsonParserEdgeCasesTest
[INFO] Running org.apache.juneau.json.CommonTest
[INFO] Tests run: 9, Failures: 0, Errors: 0, Skipped: 0, Time elapsed: 0.022 s - in org.apache.juneau.json.CommonTest
[INFO] Running org.apache.juneau.json.CommonParserTest
[INFO] Tests run: 4, Failures: 0, Errors: 0, Skipped: 0, Time elapsed: 0.026 s - in org.apache.juneau.json.CommonParserTest
[INFO] Running org.apache.juneau.json.JsonTest
[INFO] Tests run: 10, Failures: 0, Errors: 0, Skipped: 0, Time elapsed: 0.007 s - in org.apache.juneau.json.JsonTest
[INFO] Running org.apache.juneau.VisibilityTest
[INFO] Tests run: 1, Failures: 0, Errors: 0, Skipped: 0, Time elapsed: 0.182 s - in org.apache.juneau.VisibilityTest
[INFO] Running org.apache.juneau.uon.Common_UonTest
[INFO] Tests run: 8, Failures: 0, Errors: 0, Skipped: 0, Time elapsed: 0.042 s - in org.apache.juneau.uon.Common_UonTest
[INFO] Running org.apache.juneau.uon.UonParserTest
[INFO] Tests run: 5, Failures: 0, Errors: 0, Skipped: 0, Time elapsed: 0.008 s - in org.apache.juneau.uon.UonParserTest
[INFO] Running org.apache.juneau.uon.UonParserReaderTest
[INFO] Tests run: 1, Failures: 0, Errors: 0, Skipped: 0, Time elapsed: 0.008 s - in org.apache.juneau.uon.UonParserReaderTest
[INFO] Running org.apache.juneau.uon.UonConfigAnnotationTest
[INFO] Tests run: 6, Failures: 0, Errors: 0, Skipped: 0, Time elapsed: 0.009 s - in org.apache.juneau.uon.UonConfigAnnotationTest
[INFO] Running org.apache.juneau.uon.UonSerializerTest
[INFO] Tests run: 2, Failures: 0, Errors: 0, Skipped: 0, Time elapsed: 0.004 s - in org.apache.juneau.uon.UonSerializerTest
[INFO] Running org.apache.juneau.uon.CommonParser_UonTest
[INFO] Tests run: 4, Failures: 0, Errors: 0, Skipped: 0, Time elapsed: 0.036 s - in org.apache.juneau.uon.CommonParser_UonTest
[INFO] Running org.apache.juneau.serializer.SerializerConfigAnnotationTest
[INFO] Tests run: 6, Failures: 0, Errors: 0, Skipped: 0, Time elapsed: 0.017 s - in org.apache.juneau.serializer.SerializerConfigAnnotationTest
[INFO] Running org.apache.juneau.serializer.SerializerGroupTest
[INFO] Tests run: 3, Failures: 0, Errors: 0, Skipped: 0, Time elapsed: 0.008 s - in org.apache.juneau.serializer.SerializerGroupTest
[INFO] Running org.apache.juneau.serializer.ReaderObjectComboTest
[INFO] Tests run: 189, Failures: 0, Errors: 0, Skipped: 0, Time elapsed: 0.107 s - in org.apache.juneau.serializer.ReaderObjectComboTest
[INFO] Running org.apache.juneau.serializer.UriResolutionTest
[INFO] Tests run: 390, Failures: 0, Errors: 0, Skipped: 0, Time elapsed: 0.353 s - in org.apache.juneau.serializer.UriResolutionTest
[INFO] Running org.apache.juneau.urlencoding.UrlEncodingConfigAnnotationTest
[INFO] Tests run: 6, Failures: 0, Errors: 0, Skipped: 0, Time elapsed: 0.001 s - in org.apache.juneau.urlencoding.UrlEncodingConfigAnnotationTest
[INFO] Running org.apache.juneau.urlencoding.Common_UrlEncodingTest
[INFO] Tests run: 8, Failures: 0, Errors: 0, Skipped: 0, Time elapsed: 0.001 s - in org.apache.juneau.urlencoding.Common_UrlEncodingTest
[INFO] Running org.apache.juneau.urlencoding.UrlEncodingSerializerTest
[INFO] Tests run: 6, Failures: 0, Errors: 0, Skipped: 0, Time elapsed: 0.012 s - in org.apache.juneau.urlencoding.UrlEncodingSerializerTest
[INFO] Running org.apache.juneau.urlencoding.CommonParser_UrlEncodingTest
[INFO] Tests run: 5, Failures: 0, Errors: 0, Skipped: 0, Time elapsed: 0.07 s - in org.apache.juneau.urlencoding.CommonParser_UrlEncodingTest
[INFO] Running org.apache.juneau.urlencoding.UrlEncodingParserTest
[INFO] Tests run: 9, Failures: 0, Errors: 0, Skipped: 0, Time elapsed: 0.039 s - in org.apache.juneau.urlencoding.UrlEncodingParserTest
[INFO] 
[INFO] Results:
[INFO] 
[ERROR] Failures: 
[ERROR]   TemporalCalendarSwapTest>RoundTripStringSwapTest.testSwap:50->RoundTripStringSwapTest.fail:71
Test [[10] IsoLocalDateTime, Default timezone swap] failed.  Expected=[2012-12-21T07:34:56],
Actual=[2012-12-21T12:34:56]
[ERROR]   TemporalCalendarSwapTest>RoundTripStringSwapTest.testSwap:50->RoundTripStringSwapTest.fail:71
Test [[11] IsoLocalDateTime, Pacific timezone swap] failed.  Expected=[2012-12-21T07:34:56],
Actual=[2012-12-21T12:34:56]
[ERROR]   TemporalCalendarSwapTest>RoundTripStringSwapTest.testSwap:50->RoundTripStringSwapTest.fail:71
Test [[12] IsoLocalTime, Default timezone swap] failed.  Expected=[07:34:56], Actual=[12:34:56]
[ERROR]   TemporalCalendarSwapTest>RoundTripStringSwapTest.testSwap:50->RoundTripStringSwapTest.fail:71
Test [[13] IsoLocalTime, Pacific timezone swap] failed.  Expected=[07:34:56], Actual=[12:34:56]
[ERROR]   TemporalCalendarSwapTest>RoundTripStringSwapTest.testSwap:50->RoundTripStringSwapTest.fail:71
Test [[14] IsoOffsetDate, Default timezone swap] failed.  Expected=[2012-12-21-05:00], Actual=[2012-12-21Z]
[ERROR]   TemporalCalendarSwapTest>RoundTripStringSwapTest.testSwap:50->RoundTripStringSwapTest.fail:71
Test [[15] IsoOffsetDate, Pacific timezone swap] failed.  Expected=[2012-12-21-05:00], Actual=[2012-12-21Z]
[ERROR]   TemporalCalendarSwapTest>RoundTripStringSwapTest.testSwap:50->RoundTripStringSwapTest.fail:71
Test [[16] IsoOffsetDateTime, Default timezone swap] failed.  Expected=[2012-12-21T07:34:56-05:00],
Actual=[2012-12-21T12:34:56Z]
[ERROR]   TemporalCalendarSwapTest>RoundTripStringSwapTest.testSwap:50->RoundTripStringSwapTest.fail:71
Test [[17] IsoOffsetDateTime, Pacific timezone swap] failed.  Expected=[2012-12-21T07:34:56-05:00],
Actual=[2012-12-21T12:34:56Z]
[ERROR]   TemporalCalendarSwapTest>RoundTripStringSwapTest.testSwap:50->RoundTripStringSwapTest.fail:71
Test [[18] IsoOffsetTime, Default timezone swap] failed.  Expected=[07:34:56-05:00], Actual=[12:34:56Z]
[ERROR]   TemporalCalendarSwapTest>RoundTripStringSwapTest.testSwap:50->RoundTripStringSwapTest.fail:71
Test [[19] IsoOffsetTime, Pacific timezone swap] failed.  Expected=[07:34:56-05:00], Actual=[12:34:56Z]
[ERROR]   TemporalCalendarSwapTest>RoundTripStringSwapTest.testSwap:50->RoundTripStringSwapTest.fail:71
Test [[20] IsoOrdinalDate, Default timezone swap] failed.  Expected=[2012-356-05:00], Actual=[2012-356Z]
[ERROR]   TemporalCalendarSwapTest>RoundTripStringSwapTest.testSwap:50->RoundTripStringSwapTest.fail:71
Test [[21] IsoOrdinalDate, Pacific timezone swap] failed.  Expected=[2012-356-05:00], Actual=[2012-356Z]
[ERROR]   TemporalCalendarSwapTest>RoundTripStringSwapTest.testSwap:50->RoundTripStringSwapTest.fail:71
Test [[22] IsoTime, Default timezone swap] failed.  Expected=[07:34:56-05:00], Actual=[12:34:56Z]
[ERROR]   TemporalCalendarSwapTest>RoundTripStringSwapTest.testSwap:50->RoundTripStringSwapTest.fail:71
Test [[23] IsoTime, Pacific timezone swap] failed.  Expected=[07:34:56-05:00], Actual=[12:34:56Z]
[ERROR]   TemporalCalendarSwapTest>RoundTripStringSwapTest.testSwap:50->RoundTripStringSwapTest.fail:71
Test [[24] IsoWeekDate, Default timezone swap] failed.  Expected=[2012-W51-5-05:00], Actual=[2012-W51-5Z]
[ERROR]   TemporalCalendarSwapTest>RoundTripStringSwapTest.testSwap:50->RoundTripStringSwapTest.fail:71
Test [[25] IsoWeekDate, Pacific timezone swap] failed.  Expected=[2012-W51-5-05:00], Actual=[2012-W51-5Z]
[ERROR]   TemporalCalendarSwapTest>RoundTripStringSwapTest.testSwap:50->RoundTripStringSwapTest.fail:71
Test [[26] IsoZonedDateTime, Default timezone swap] failed.  Expected=[2012-12-21T07:34:56-05:00[America/New_York]],
Actual=[2012-12-21T12:34:56Z[Etc/UTC]]
[ERROR]   TemporalCalendarSwapTest>RoundTripStringSwapTest.testSwap:50->RoundTripStringSwapTest.fail:71
Test [[27] IsoZonedDateTime, Pacific timezone swap] failed.  Expected=[2012-12-21T07:34:56-05:00[America/New_York]],
Actual=[2012-12-21T12:34:56Z[Etc/UTC]]
[ERROR]   TemporalCalendarSwapTest>RoundTripStringSwapTest.testSwap:50->RoundTripStringSwapTest.fail:71
Test [[28] Rfc1123DateTime, Default timezone swap] failed.  Expected=[Fri, 21 Dec 2012 07:34:56
-0500], Actual=[Fri, 21 Dec 2012 12:34:56 GMT]
[ERROR]   TemporalCalendarSwapTest>RoundTripStringSwapTest.testSwap:50->RoundTripStringSwapTest.fail:71
Test [[29] Rfc1123DateTime, Pacific timezone swap] failed.  Expected=[Fri, 21 Dec 2012 07:34:56
-0500], Actual=[Fri, 21 Dec 2012 12:34:56 GMT]
[ERROR]   TemporalCalendarSwapTest>RoundTripStringSwapTest.testSwap:50->RoundTripStringSwapTest.fail:71
Test [[2] IsoDate, Default timezone swap] failed.  Expected=[2012-12-21-05:00], Actual=[2012-12-21Z]
[ERROR]   TemporalCalendarSwapTest>RoundTripStringSwapTest.testSwap:50->RoundTripStringSwapTest.fail:71
Test [[3] IsoDate, Pacific timezone swap] failed.  Expected=[2012-12-21-05:00], Actual=[2012-12-21Z]
[ERROR]   TemporalCalendarSwapTest>RoundTripStringSwapTest.testSwap:50->RoundTripStringSwapTest.fail:71
Test [[4] IsoDateTime, Default timezone swap] failed.  Expected=[2012-12-21T07:34:56-05:00[America/New_York]],
Actual=[2012-12-21T12:34:56Z[Etc/UTC]]
[ERROR]   TemporalCalendarSwapTest>RoundTripStringSwapTest.testSwap:50->RoundTripStringSwapTest.fail:71
Test [[5] IsoDateTime, Pacific timezone swap] failed.  Expected=[2012-12-21T07:34:56-05:00[America/New_York]],
Actual=[2012-12-21T12:34:56Z[Etc/UTC]]
[INFO] 
[ERROR] Tests run: 20232, Failures: 24, Errors: 0, Skipped: 2
[INFO] 
[INFO]                                                                         
[INFO] ------------------------------------------------------------------------
[INFO] Skipping Apache Juneau
[INFO] This project has been banned from the build due to previous failures.
[INFO] ------------------------------------------------------------------------
[INFO] ------------------------------------------------------------------------
[INFO] Reactor Summary:
[INFO] 
[INFO] Apache Juneau ...................................... SUCCESS [ 11.472 s]
[INFO] Apache Juneau - Core APIs .......................... SUCCESS [  8.862 s]
[INFO] Apache Juneau Marshall ............................. SUCCESS [01:03 min]
[INFO] Apache Juneau Marshal RDF .......................... SUCCESS [ 24.315 s]
[INFO] Apache Juneau Data Transfer Objects ................ SUCCESS [ 16.634 s]
[INFO] Apache Juneau Core ................................. SUCCESS [ 10.112 s]
[INFO] Apache Juneau Config File API ...................... SUCCESS [ 17.998 s]
[INFO] Apache Juneau Core (Unit Tests) .................... FAILURE [ 53.637 s]
[INFO] Apache Juneau - REST APIs .......................... SKIPPED
[INFO] Apache Juneau REST Servlet API ..................... SKIPPED
[INFO] Apache Juneau REST JAX/RS API ...................... SKIPPED
[INFO] Apache Juneau REST Servlet API, RDF support ........ SKIPPED
[INFO] Apache Juneau REST Spring Boot Integration ......... SKIPPED
[INFO] Apache Juneau REST Client API ...................... SKIPPED
[INFO] Apache Juneau REST Mock API ........................ SKIPPED
[INFO] Apache Juneau REST Mock API (Unit Tests) ........... SKIPPED
[INFO] Apache Juneau REST Servlet API (Unit Tests) ........ SKIPPED
[INFO] Apache Juneau REST Client API (Unit Tests) ......... SKIPPED
[INFO] Apache Juneau - Microservice APIs .................. SKIPPED
[INFO] Apache Juneau Microservice Core Library ............ SKIPPED
[INFO] Apache Juneau Microservice Server .................. SKIPPED
[INFO] Apache Juneau Jetty Microservice Template .......... SKIPPED
[INFO] Apache Juneau - Examples ........................... SKIPPED
[INFO] Apache Juneau REST Examples ........................ SKIPPED
[INFO] Apache Juneau Microservice (Function Tests) ........ SKIPPED
[INFO] Apache Juneau Spring Boot Microservice Template .... SKIPPED
[INFO] Apache Juneau Core Examples ........................ SKIPPED
[INFO] Apache Juneau REST Examples using Jetty ............ SKIPPED
[INFO] Apache Juneau REST Examples using Spring Boot ...... SKIPPED
[INFO] Apache Juneau REST Examples (Function Tests) ....... SKIPPED
[INFO] Apache Juneau Javadocs ............................. SKIPPED
[INFO] Apache Juneau - Release Engineering ................ SKIPPED
[INFO] Apache Juneau UberJar .............................. SKIPPED
[INFO] Apache Juneau Distribution ......................... SKIPPED
[INFO] Apache Juneau - Configuration Server ............... SKIPPED
[INFO] Apache Juneau Configuration Server API ............. SKIPPED
[INFO] Apache Juneau Configuration Server - Client API .... SKIPPED
[INFO] ------------------------------------------------------------------------
[INFO] BUILD FAILURE
[INFO] ------------------------------------------------------------------------
[INFO] Total time: 03:28 min
[INFO] Finished at: 2019-07-22T21:48:01+00:00
[INFO] Final Memory: 62M/971M
[INFO] ------------------------------------------------------------------------
[ERROR] Failed to execute goal org.apache.maven.plugins:maven-surefire-plugin:2.22.0:test
(default-test) on project juneau-core-utest: There are test failures.
[ERROR] 
[ERROR] Please refer to <https://builds.apache.org/job/Juneau-Java-1.8/ws/juneau-core/juneau-core-utest/target/surefire-reports>
for the individual test results.
[ERROR] Please refer to dump files (if any exist) [date]-jvmRun[N].dump, [date].dumpstream
and [date]-jvmRun[N].dumpstream.
[ERROR] -> [Help 1]
[ERROR] 
[ERROR] To see the full stack trace of the errors, re-run Maven with the -e switch.
[ERROR] Re-run Maven using the -X switch to enable full debug logging.
[ERROR] 
[ERROR] For more information about the errors and possible solutions, please read the following
articles:
[ERROR] [Help 1] http://cwiki.apache.org/confluence/display/MAVEN/MojoFailureException
[ERROR] 
[ERROR] After correcting the problems, you can resume the build with the command
[ERROR]   mvn <goals> -rf :juneau-core-utest
Build step 'Invoke top-level Maven targets' marked build as failure
Recording test results
[TASKS] Skipping publisher since build result is FAILURE

Mime
View raw message