juneau-dev mailing list archives

Site index · List index
Message view « Date » · « Thread »
Top « Date » · « Thread »
From Apache Jenkins Server <jenk...@builds.apache.org>
Subject Build failed in Jenkins: Juneau-Java-1.8 #1305
Date Sun, 31 Mar 2019 13:38:35 GMT
See <https://builds.apache.org/job/Juneau-Java-1.8/1305/display/redirect>

------------------------------------------
[...truncated 1.71 MB...]
Generating src-html/org/apache/juneau/examples/rest/RootResources.html...
Generating src-html/org/apache/juneau/examples/rest/HelloWorldResource.html...
Generating src-html/org/apache/juneau/examples/rest/RequestEchoResource.html...
Generating src-html/org/apache/juneau/examples/rest/dto/DtoExamples.html...
Generating src-html/org/apache/juneau/examples/rest/dto/PredefinedLabelsResource.html...
Generating src-html/org/apache/juneau/examples/rest/dto/AtomFeedResource.html...
Generating src-html/org/apache/juneau/examples/rest/dto/JsonSchemaResource.html...
Generating src-html/org/apache/juneau/examples/rest/command/EchoCommand.html...
Generating src-html/org/apache/juneau/examples/rest/petstore/PetStoreService.html...
Generating src-html/org/apache/juneau/examples/rest/petstore/AbstractPersistenceService.html...
Generating src-html/org/apache/juneau/examples/rest/petstore/InvalidSpecies.html...
Generating src-html/org/apache/juneau/examples/rest/petstore/ExpiresAfter.html...
Generating src-html/org/apache/juneau/examples/rest/petstore/InvalidId.html...
Generating src-html/org/apache/juneau/examples/rest/petstore/IdNotFound.html...
Generating src-html/org/apache/juneau/examples/rest/petstore/InvalidTag.html...
Generating src-html/org/apache/juneau/examples/rest/petstore/InvalidLogin.html...
Generating src-html/org/apache/juneau/examples/rest/petstore/InvalidUsername.html...
Generating src-html/org/apache/juneau/examples/rest/petstore/IdConflict.html...
Generating src-html/org/apache/juneau/examples/rest/petstore/rest/UploadPhotoMenuItem.html...
Generating src-html/org/apache/juneau/examples/rest/petstore/rest/SqlQueryResource.html...
Generating src-html/org/apache/juneau/examples/rest/petstore/rest/SqlQueryResource.PostInput.html...
Generating src-html/org/apache/juneau/examples/rest/petstore/rest/AddPetMenuItem.html...
Generating src-html/org/apache/juneau/examples/rest/petstore/rest/PetStore.html...
Generating src-html/org/apache/juneau/examples/rest/petstore/rest/AddOrderMenuItem.html...
Generating src-html/org/apache/juneau/examples/rest/petstore/rest/PetStoreResource.html...
Generating src-html/org/apache/juneau/examples/rest/petstore/rest/PhotosResource.html...
Generating src-html/org/apache/juneau/examples/rest/petstore/rest/PhotosResource.Photo.html...
Generating src-html/org/apache/juneau/examples/rest/petstore/rest/PhotosResource.ImageSerializer.html...
Generating src-html/org/apache/juneau/examples/rest/petstore/rest/PhotosResource.ImageParser.html...
Generating src-html/org/apache/juneau/examples/rest/petstore/dto/UpdatePet.html...
Generating src-html/org/apache/juneau/examples/rest/petstore/dto/UserStatus.html...
Generating src-html/org/apache/juneau/examples/rest/petstore/dto/UserStatus.UserStatusRender.html...
Generating src-html/org/apache/juneau/examples/rest/petstore/dto/Species.html...
Generating src-html/org/apache/juneau/examples/rest/petstore/dto/Species.SpeciesRender.html...
Generating src-html/org/apache/juneau/examples/rest/petstore/dto/PetTagNameSwap.html...
Generating src-html/org/apache/juneau/examples/rest/petstore/dto/OrderStatus.html...
Generating src-html/org/apache/juneau/examples/rest/petstore/dto/OrderStatus.OrderStatusRender.html...
Generating src-html/org/apache/juneau/examples/rest/petstore/dto/PetTag.html...
Generating src-html/org/apache/juneau/examples/rest/petstore/dto/CreatePet.html...
Generating src-html/org/apache/juneau/examples/rest/petstore/dto/PetStatus.html...
Generating src-html/org/apache/juneau/examples/rest/petstore/dto/PetStatus.PetStatusRender.html...
Generating src-html/org/apache/juneau/examples/rest/petstore/dto/Pet.html...
Generating src-html/org/apache/juneau/examples/rest/petstore/dto/Pet.PriceRender.html...
Generating src-html/org/apache/juneau/examples/rest/petstore/dto/User.html...
Generating src-html/org/apache/juneau/examples/rest/petstore/dto/Order.html...
Generating src-html/org/apache/juneau/examples/rest/petstore/dto/CreateOrder.html...
Generating src-html/org/apache/juneau/microservice/springboot/template/App.html...
Generating src-html/org/apache/juneau/microservice/springboot/template/RootResources.html...
Generating src-html/org/apache/juneau/microservice/springboot/template/HelloWorldResource.html...
Generating src-html/org/apache/juneau/examples/core/html/HtmlSimpleExample.html...
Generating src-html/org/apache/juneau/examples/core/html/HtmlComplexExample.html...
Generating src-html/org/apache/juneau/examples/core/uon/UONExample.html...
Generating src-html/org/apache/juneau/examples/core/uon/UONComplexExample.html...
Generating src-html/org/apache/juneau/examples/core/dto/DtoExample.html...
Generating src-html/org/apache/juneau/examples/core/dto/atom/AtomJsonExample.html...
Generating src-html/org/apache/juneau/examples/core/dto/atom/AtomFeed.html...
Generating src-html/org/apache/juneau/examples/core/dto/atom/AtomHtmlExample.html...
Generating src-html/org/apache/juneau/examples/core/dto/atom/AtomXmlExample.html...
Generating src-html/org/apache/juneau/examples/core/svl/SvlExample.html...
Generating src-html/org/apache/juneau/examples/core/json/JsonConfigurationExample.html...
Generating src-html/org/apache/juneau/examples/core/json/JsonSimpleExample.html...
Generating src-html/org/apache/juneau/examples/core/json/JsonComplexExample.html...
Generating src-html/org/apache/juneau/examples/core/oapi/OapiExample.html...
Generating src-html/org/apache/juneau/examples/core/xml/XmlConfigurationExample.html...
Generating src-html/org/apache/juneau/examples/core/xml/XmlComplexExample.html...
Generating src-html/org/apache/juneau/examples/core/xml/XmlSimpleExample.html...
Generating src-html/org/apache/juneau/examples/core/rdf/RdfComplexExample.html...
Generating src-html/org/apache/juneau/examples/core/rdf/RdfExample.html...
Generating src-html/org/apache/juneau/examples/core/pojo/PojoComplex.html...
Generating src-html/org/apache/juneau/examples/core/pojo/Pojo.html...
Generating src-html/org/apache/juneau/examples/rest/jetty/App.html...
Generating src-html/org/apache/juneau/examples/rest/springboot/App.html...
Copying file StandardDocFile[<https://builds.apache.org/job/Juneau-Java-1.8/ws/juneau-doc/src/main/javadoc/javadoc.css]>
to file javadoc.css...
Building index for all the packages and classes...
Generating <https://builds.apache.org/job/Juneau-Java-1.8/ws/target/site/apidocs/overview-tree.html...>
Generating <https://builds.apache.org/job/Juneau-Java-1.8/ws/target/site/apidocs/index-all.html...>
Generating <https://builds.apache.org/job/Juneau-Java-1.8/ws/target/site/apidocs/deprecated-list.html...>
Building index for all classes...
Generating <https://builds.apache.org/job/Juneau-Java-1.8/ws/target/site/apidocs/allclasses-frame.html...>
Generating <https://builds.apache.org/job/Juneau-Java-1.8/ws/target/site/apidocs/allclasses-noframe.html...>
Generating <https://builds.apache.org/job/Juneau-Java-1.8/ws/target/site/apidocs/index.html...>
Generating <https://builds.apache.org/job/Juneau-Java-1.8/ws/target/site/apidocs/overview-summary.html...>
Generating <https://builds.apache.org/job/Juneau-Java-1.8/ws/target/site/apidocs/help-doc.html...>
Note: Custom tags that could override future standard tags:  @fragment, @property, @doc, @source.
To avoid potential overrides, use at least one period character (.) in custom tag names.
5 warnings
[WARNING] Javadoc Warnings
[WARNING] javadoc: warning - Multiple sources of package comments found for package "org.apache.juneau.dto.cognos"
[WARNING] javadoc: warning - Multiple sources of package comments found for package "org.apache.juneau.dto.atom"
[WARNING] [ERROR] Unknown doc tag: juneau-rest-server.UnitTesting
[WARNING] [ERROR] Unknown doc tag: juneau-rest-server.UnitTesting
[WARNING] [ERROR] Unknown doc tag: juneau-rest-client.UnitTesting
[WARNING] [ERROR] Unknown doc tag: juneau-rest-server.UnitTesting
[WARNING] [ERROR] Unknown doc tag: juneau-rest-server.UnitTesting
[WARNING] <https://builds.apache.org/job/Juneau-Java-1.8/ws/juneau-doc/src/main/javadoc/overview.html>:
warning - Tag @link: can't find getMethodSignature(Method) in org.apache.juneau.internal.ClassUtils
[WARNING] <https://builds.apache.org/job/Juneau-Java-1.8/ws/juneau-doc/src/main/javadoc/overview.html>:
warning - Tag @link: can't find getReadableClassName(Class) in org.apache.juneau.internal.ClassUtils
[WARNING] <https://builds.apache.org/job/Juneau-Java-1.8/ws/juneau-doc/src/main/javadoc/overview.html>:
warning - Tag @link: reference not found: org.apache.juneau.internal.ByteArrayCache
[INFO] ------------------------------------------------------------------------
[INFO] Reactor Summary:
[INFO] 
[INFO] Apache Juneau ...................................... SUCCESS [ 22.109 s]
[INFO] Apache Juneau - Core APIs .......................... SUCCESS [  4.197 s]
[INFO] Apache Juneau Marshall ............................. SUCCESS [ 37.685 s]
[INFO] Apache Juneau Marshal RDF .......................... SUCCESS [ 12.539 s]
[INFO] Apache Juneau Data Transfer Objects ................ SUCCESS [ 15.218 s]
[INFO] Apache Juneau Core ................................. SUCCESS [ 11.315 s]
[INFO] Apache Juneau Config File API ...................... SUCCESS [ 11.689 s]
[INFO] Apache Juneau Core Tests ........................... SUCCESS [ 50.285 s]
[INFO] Apache Juneau - REST APIs .......................... SUCCESS [  4.053 s]
[INFO] Apache Juneau REST Servlet API ..................... SUCCESS [ 20.071 s]
[INFO] Apache Juneau REST JAX/RS API ...................... SUCCESS [ 10.833 s]
[INFO] Apache Juneau REST Servlet API, RDF support ........ SUCCESS [ 15.223 s]
[INFO] Apache Juneau REST Spring Boot Integration ......... SUCCESS [ 13.528 s]
[INFO] Apache Juneau REST Client API ...................... SUCCESS [ 12.346 s]
[INFO] Apache Juneau REST Mock API ........................ SUCCESS [ 15.199 s]
[INFO] Apache Juneau REST Servlet API - Tests ............. SUCCESS [ 25.844 s]
[INFO] Apache Juneau REST Client API - Tests .............. SUCCESS [ 15.752 s]
[INFO] Apache Juneau - Microservice APIs .................. SUCCESS [  4.004 s]
[INFO] Apache Juneau Microservice Core Library ............ SUCCESS [ 10.268 s]
[INFO] Apache Juneau Microservice Server .................. SUCCESS [  9.423 s]
[INFO] Apache Juneau Jetty Microservice Template .......... SUCCESS [  9.891 s]
[INFO] Apache Juneau - Examples ........................... SUCCESS [  3.940 s]
[INFO] Apache Juneau REST Examples ........................ SUCCESS [ 10.848 s]
[INFO] Apache Juneau Microservice Tests ................... SUCCESS [ 34.991 s]
[INFO] Apache Juneau Spring Boot Microservice Template .... SUCCESS [ 10.678 s]
[INFO] Apache Juneau Core Examples ........................ SUCCESS [  9.506 s]
[INFO] Apache Juneau REST Examples using Jetty ............ SUCCESS [ 21.459 s]
[INFO] Apache Juneau REST Examples using Spring Boot ...... SUCCESS [ 18.629 s]
[INFO] Apache Juneau Javadocs ............................. SUCCESS [ 12.356 s]
[INFO] Apache Juneau - Release Engineering ................ SUCCESS [  3.942 s]
[INFO] Apache Juneau UberJar .............................. SUCCESS [ 12.758 s]
[INFO] Apache Juneau Distribution ......................... SUCCESS [ 15.169 s]
[INFO] ------------------------------------------------------------------------
[INFO] BUILD SUCCESS
[INFO] ------------------------------------------------------------------------
[INFO] Total time: 08:14 min
[INFO] Finished at: 2019-03-31T13:38:03+00:00
[INFO] Final Memory: 159M/4291M
[INFO] ------------------------------------------------------------------------
Recording test results
[TASKS] Scanning folder '<https://builds.apache.org/job/Juneau-Java-1.8/ws/'> for files
matching the pattern '**/*.java' - excludes: 
[TASKS] Found 1482 files to scan for tasks
[TASKS] Found 32 open tasks.
No credentials specified
<Git Blamer> Using GitBlamer to create author and commit information for all warnings.
<Git Blamer> GIT_COMMIT=1ed6b529f357e31677b1e093d76fc63d8cb3df9d, workspace=<https://builds.apache.org/job/Juneau-Java-1.8/ws/>
 > git rev-parse 1ed6b529f357e31677b1e093d76fc63d8cb3df9d^{commit} # timeout=10
[TASKS] Computing warning deltas based on reference build #1302
[JaCoCo plugin] Collecting JaCoCo coverage data...
[JaCoCo plugin] **/**.exec;**/classes;**/src/main/java; locations are configured
[JaCoCo plugin] Number of found exec files for pattern **/**.exec: 4
[JaCoCo plugin] Saving matched execfiles:  <https://builds.apache.org/job/Juneau-Java-1.8/ws/juneau-core/juneau-core-test/target/jacoco.exec>
<https://builds.apache.org/job/Juneau-Java-1.8/ws/juneau-microservice/juneau-microservice-test/target/jacoco.exec>
<https://builds.apache.org/job/Juneau-Java-1.8/ws/juneau-rest/juneau-rest-client-test/target/jacoco.exec>
<https://builds.apache.org/job/Juneau-Java-1.8/ws/juneau-rest/juneau-rest-server-test/target/jacoco.exec>
[JaCoCo plugin] Saving matched class directories for class-pattern: **/classes: 
[JaCoCo plugin]  - <https://builds.apache.org/job/Juneau-Java-1.8/ws/juneau-core/juneau-config/target/classes>
31 files
[JaCoCo plugin]  - <https://builds.apache.org/job/Juneau-Java-1.8/ws/juneau-core/juneau-core-test/target/classes>
0 files
[JaCoCo plugin]  - <https://builds.apache.org/job/Juneau-Java-1.8/ws/juneau-core/juneau-dto/target/classes>
173 files
[JaCoCo plugin]  - <https://builds.apache.org/job/Juneau-Java-1.8/ws/juneau-core/juneau-marshall-rdf/target/classes>
31 files
[JaCoCo plugin]  - <https://builds.apache.org/job/Juneau-Java-1.8/ws/juneau-core/juneau-marshall/target/classes>
732 files
[JaCoCo plugin]  - <https://builds.apache.org/job/Juneau-Java-1.8/ws/juneau-core/juneau-svl/target/classes>
28 files
[JaCoCo plugin]  - <https://builds.apache.org/job/Juneau-Java-1.8/ws/juneau-doc/target/classes>
14 files
[JaCoCo plugin]  - <https://builds.apache.org/job/Juneau-Java-1.8/ws/juneau-examples/juneau-examples-core/target/classes>
21 files
[JaCoCo plugin]  - <https://builds.apache.org/job/Juneau-Java-1.8/ws/juneau-examples/juneau-examples-rest-jetty/target/classes>
1 files
[JaCoCo plugin]  - <https://builds.apache.org/job/Juneau-Java-1.8/ws/juneau-examples/juneau-examples-rest-springboot/target/classes>
1 files
[JaCoCo plugin]  - <https://builds.apache.org/job/Juneau-Java-1.8/ws/juneau-examples/juneau-examples-rest/target/classes>
52 files
[JaCoCo plugin]  - <https://builds.apache.org/job/Juneau-Java-1.8/ws/juneau-microservice/juneau-microservice-core/target/classes>
34 files
[JaCoCo plugin]  - <https://builds.apache.org/job/Juneau-Java-1.8/ws/juneau-microservice/juneau-microservice-jetty/target/classes>
9 files
[JaCoCo plugin]  - <https://builds.apache.org/job/Juneau-Java-1.8/ws/juneau-microservice/juneau-microservice-test/target/classes>
6 files
[JaCoCo plugin]  - <https://builds.apache.org/job/Juneau-Java-1.8/ws/juneau-microservice/juneau-my-jetty-microservice/target/classes>
3 files
[JaCoCo plugin]  - <https://builds.apache.org/job/Juneau-Java-1.8/ws/juneau-microservice/juneau-my-springboot-microservice/target/classes>
3 files
[JaCoCo plugin]  - <https://builds.apache.org/job/Juneau-Java-1.8/ws/juneau-releng/juneau-all/target/classes>
0 files
[JaCoCo plugin]  - <https://builds.apache.org/job/Juneau-Java-1.8/ws/juneau-rest/juneau-rest-client-test/target/classes>
0 files
[JaCoCo plugin]  - <https://builds.apache.org/job/Juneau-Java-1.8/ws/juneau-rest/juneau-rest-client/target/classes>
44 files
[JaCoCo plugin]  - <https://builds.apache.org/job/Juneau-Java-1.8/ws/juneau-rest/juneau-rest-mock/target/classes>
14 files
[JaCoCo plugin]  - <https://builds.apache.org/job/Juneau-Java-1.8/ws/juneau-rest/juneau-rest-server-jaxrs/target/classes>
3 files
[JaCoCo plugin]  - <https://builds.apache.org/job/Juneau-Java-1.8/ws/juneau-rest/juneau-rest-server-rdf/target/classes>
4 files
[JaCoCo plugin]  - <https://builds.apache.org/job/Juneau-Java-1.8/ws/juneau-rest/juneau-rest-server-springboot/target/classes>
4 files
[JaCoCo plugin]  - <https://builds.apache.org/job/Juneau-Java-1.8/ws/juneau-rest/juneau-rest-server-test/target/classes>
0 files
[JaCoCo plugin]  - <https://builds.apache.org/job/Juneau-Java-1.8/ws/juneau-rest/juneau-rest-server/target/classes>
222 files
[JaCoCo plugin] Saving matched source directories for source-pattern: **/src/main/java: 
[JaCoCo plugin] Source Inclusions: **/*.java
[JaCoCo plugin] Source Exclusions: 
[JaCoCo plugin] - <https://builds.apache.org/job/Juneau-Java-1.8/ws/juneau-core/juneau-config/src/main/java>
28 files
[JaCoCo plugin] - <https://builds.apache.org/job/Juneau-Java-1.8/ws/juneau-core/juneau-core-test/src/main/java>
0 files
[JaCoCo plugin] - <https://builds.apache.org/job/Juneau-Java-1.8/ws/juneau-core/juneau-dto/src/main/java>
168 files
[JaCoCo plugin] - <https://builds.apache.org/job/Juneau-Java-1.8/ws/juneau-core/juneau-marshall-rdf/src/main/java>
32 files
[JaCoCo plugin] - <https://builds.apache.org/job/Juneau-Java-1.8/ws/juneau-core/juneau-marshall/src/main/java>
522 files
[JaCoCo plugin] - <https://builds.apache.org/job/Juneau-Java-1.8/ws/juneau-core/juneau-svl/src/main/java>
30 files
[JaCoCo plugin] - <https://builds.apache.org/job/Juneau-Java-1.8/ws/juneau-doc/src/main/java>
9 files
[JaCoCo plugin] - <https://builds.apache.org/job/Juneau-Java-1.8/ws/juneau-examples/juneau-examples-core/src/main/java>
31 files
[JaCoCo plugin] - <https://builds.apache.org/job/Juneau-Java-1.8/ws/juneau-examples/juneau-examples-rest-jetty/src/main/java>
2 files
[JaCoCo plugin] - <https://builds.apache.org/job/Juneau-Java-1.8/ws/juneau-examples/juneau-examples-rest-springboot/src/main/java>
2 files
[JaCoCo plugin] - <https://builds.apache.org/job/Juneau-Java-1.8/ws/juneau-examples/juneau-examples-rest/src/main/java>
44 files
[JaCoCo plugin] - <https://builds.apache.org/job/Juneau-Java-1.8/ws/juneau-microservice/juneau-microservice-core/src/main/java>
20 files
[JaCoCo plugin] - <https://builds.apache.org/job/Juneau-Java-1.8/ws/juneau-microservice/juneau-microservice-jetty/src/main/java>
10 files
[JaCoCo plugin] - <https://builds.apache.org/job/Juneau-Java-1.8/ws/juneau-microservice/juneau-microservice-test/src/main/java>
6 files
[JaCoCo plugin] - <https://builds.apache.org/job/Juneau-Java-1.8/ws/juneau-microservice/juneau-my-jetty-microservice/src/main/java>
4 files
[JaCoCo plugin] - <https://builds.apache.org/job/Juneau-Java-1.8/ws/juneau-microservice/juneau-my-springboot-microservice/src/main/java>
4 files
[JaCoCo plugin] - <https://builds.apache.org/job/Juneau-Java-1.8/ws/juneau-rest/juneau-rest-client/src/main/java>
30 files
[JaCoCo plugin] - <https://builds.apache.org/job/Juneau-Java-1.8/ws/juneau-rest/juneau-rest-mock/src/main/java>
12 files
[JaCoCo plugin] - <https://builds.apache.org/job/Juneau-Java-1.8/ws/juneau-rest/juneau-rest-server-jaxrs/src/main/java>
4 files
[JaCoCo plugin] - <https://builds.apache.org/job/Juneau-Java-1.8/ws/juneau-rest/juneau-rest-server-rdf/src/main/java>
4 files
[JaCoCo plugin] - <https://builds.apache.org/job/Juneau-Java-1.8/ws/juneau-rest/juneau-rest-server-springboot/src/main/java>
6 files
[JaCoCo plugin] - <https://builds.apache.org/job/Juneau-Java-1.8/ws/juneau-rest/juneau-rest-server/src/main/java>
173 files
[JaCoCo plugin] Loading inclusions files..
[JaCoCo plugin] inclusions: []
[JaCoCo plugin] exclusions: [**/doc/**/*.class, **/examples/**/*.class, **/testutils/**/*.class]
[JaCoCo plugin] Thresholds: JacocoHealthReportThresholds [minClass=0, maxClass=0, minMethod=0,
maxMethod=0, minLine=0, maxLine=0, minBranch=0, maxBranch=0, minInstruction=0, maxInstruction=0,
minComplexity=0, maxComplexity=0]
[JaCoCo plugin] Publishing the results..
[JaCoCo plugin] Loading packages..
[JaCoCo plugin] Done.
[JaCoCo plugin] Overall coverage: class: 85, method: 55, line: 65, branch: 69, instruction:
67
ERROR: Build step failed with exception
Also:   hudson.remoting.Channel$CallSiteStackTrace: Remote call to ubuntu-1
		at hudson.remoting.Channel.attachCallSiteStackTrace(Channel.java:1741)
		at hudson.remoting.UserRequest$ExceptionResponse.retrieve(UserRequest.java:357)
		at hudson.remoting.Channel.call(Channel.java:955)
		at hudson.FilePath.act(FilePath.java:1072)
		at hudson.FilePath.act(FilePath.java:1061)
		at com.github.terma.jenkins.githubprcoveragestatus.GetCoverageCallable.get(GetCoverageCallable.java:59)
		at com.github.terma.jenkins.githubprcoveragestatus.MasterCoverageAction.perform(MasterCoverageAction.java:93)
		at hudson.tasks.BuildStepCompatibilityLayer.perform(BuildStepCompatibilityLayer.java:81)
		at hudson.tasks.BuildStepMonitor$1.perform(BuildStepMonitor.java:20)
		at hudson.model.AbstractBuild$AbstractBuildExecution.perform(AbstractBuild.java:744)
		at hudson.model.AbstractBuild$AbstractBuildExecution.performAllBuildSteps(AbstractBuild.java:690)
		at hudson.model.Build$BuildExecution.post2(Build.java:186)
		at hudson.model.AbstractBuild$AbstractBuildExecution.post(AbstractBuild.java:635)
		at hudson.model.Run.execute(Run.java:1835)
		at hudson.model.FreeStyleBuild.run(FreeStyleBuild.java:43)
		at hudson.model.ResourceController.execute(ResourceController.java:97)
		at hudson.model.Executor.run(Executor.java:429)
java.lang.IllegalArgumentException: Strange Jacoco report!
File path: <https://builds.apache.org/job/Juneau-Java-1.8/ws/juneau-core/juneau-core-test/target/site/jacoco/jacoco.xml>
Can't extract float value by XPath: /report/counter[@type='INSTRUCTION']/@missed
from:
<?xml version="1.0" encoding="UTF-8" standalone="yes"?><!DOCTYPE report PUBLIC "-//JACOCO//DTD
Report 1.1//EN" "report.dtd"><report name="Apache Juneau Core Tests"><sessioninfo
id="pietas.apache.org-f2d4b56c" start="1554039096337" dump="1554039122920"/></report>
	at com.github.terma.jenkins.githubprcoveragestatus.JacocoParser.getByXpath(JacocoParser.java:54)
	at com.github.terma.jenkins.githubprcoveragestatus.JacocoParser.get(JacocoParser.java:76)
	at com.github.terma.jenkins.githubprcoveragestatus.GetCoverageCallable.getFloats(GetCoverageCallable.java:49)
	at com.github.terma.jenkins.githubprcoveragestatus.GetCoverageCallable.invoke(GetCoverageCallable.java:67)
	at com.github.terma.jenkins.githubprcoveragestatus.GetCoverageCallable.invoke(GetCoverageCallable.java:32)
	at hudson.FilePath$FileCallableWrapper.call(FilePath.java:3086)
	at hudson.remoting.UserRequest.perform(UserRequest.java:212)
	at hudson.remoting.UserRequest.perform(UserRequest.java:54)
	at hudson.remoting.Request$2.run(Request.java:369)
	at hudson.remoting.InterceptingExecutorService$1.call(InterceptingExecutorService.java:72)
	at java.util.concurrent.FutureTask.run(FutureTask.java:266)
	at java.util.concurrent.ThreadPoolExecutor.runWorker(ThreadPoolExecutor.java:1142)
	at java.util.concurrent.ThreadPoolExecutor$Worker.run(ThreadPoolExecutor.java:617)
	at java.lang.Thread.run(Thread.java:748)
Build step 'Record Master Coverage' marked build as failure

Mime
View raw message