juneau-dev mailing list archives

Site index · List index
Message view « Date » · « Thread »
Top « Date » · « Thread »
From Apache Jenkins Server <jenk...@builds.apache.org>
Subject Build failed in Jenkins: Juneau-Java-1.8 #1306
Date Sun, 31 Mar 2019 14:06:02 GMT
See <https://builds.apache.org/job/Juneau-Java-1.8/1306/display/redirect>

------------------------------------------
[...truncated 190.81 KB...]
[INFO] Tests run: 3, Failures: 0, Errors: 0, Skipped: 0, Time elapsed: 0.001 s - in org.apache.juneau.dto.swagger.LicenseTest
[INFO] Running org.apache.juneau.dto.swagger.SwaggerBuilderTest
[INFO] Tests run: 31, Failures: 0, Errors: 0, Skipped: 0, Time elapsed: 0.118 s - in org.apache.juneau.dto.swagger.SwaggerBuilderTest
[INFO] Running org.apache.juneau.dto.swagger.SchemaInfoTest
[INFO] Tests run: 37, Failures: 0, Errors: 0, Skipped: 0, Time elapsed: 0.043 s - in org.apache.juneau.dto.swagger.SchemaInfoTest
[INFO] Running org.apache.juneau.dto.swagger.ContactTest
[INFO] Tests run: 4, Failures: 0, Errors: 0, Skipped: 0, Time elapsed: 0.001 s - in org.apache.juneau.dto.swagger.ContactTest
[INFO] Running org.apache.juneau.dto.swagger.ParameterInfoTest
[INFO] Tests run: 26, Failures: 0, Errors: 0, Skipped: 0, Time elapsed: 0.02 s - in org.apache.juneau.dto.swagger.ParameterInfoTest
[INFO] Running org.apache.juneau.dto.swagger.SecuritySchemeTest
[INFO] Tests run: 11, Failures: 0, Errors: 0, Skipped: 0, Time elapsed: 0.004 s - in org.apache.juneau.dto.swagger.SecuritySchemeTest
[INFO] Running org.apache.juneau.dto.swagger.ResponseInfoTest
[INFO] Tests run: 11, Failures: 0, Errors: 0, Skipped: 0, Time elapsed: 0.024 s - in org.apache.juneau.dto.swagger.ResponseInfoTest
[INFO] Running org.apache.juneau.dto.swagger.TagTest
[INFO] Tests run: 4, Failures: 0, Errors: 0, Skipped: 0, Time elapsed: 0.017 s - in org.apache.juneau.dto.swagger.TagTest
[INFO] Running org.apache.juneau.dto.swagger.SwaggerTest
[INFO] Tests run: 42, Failures: 0, Errors: 0, Skipped: 0, Time elapsed: 0.17 s - in org.apache.juneau.dto.swagger.SwaggerTest
[INFO] Running org.apache.juneau.dto.swagger.ItemsTest
[INFO] Tests run: 20, Failures: 0, Errors: 0, Skipped: 0, Time elapsed: 0.001 s - in org.apache.juneau.dto.swagger.ItemsTest
[INFO] Running org.apache.juneau.dto.swagger.InfoTest
[INFO] Tests run: 7, Failures: 0, Errors: 0, Skipped: 0, Time elapsed: 0 s - in org.apache.juneau.dto.swagger.InfoTest
[INFO] Running org.apache.juneau.dto.swagger.OperationTest
[INFO] Tests run: 29, Failures: 0, Errors: 0, Skipped: 0, Time elapsed: 0.022 s - in org.apache.juneau.dto.swagger.OperationTest
[INFO] Running org.apache.juneau.dto.swagger.HeaderInfoTest
[INFO] Tests run: 21, Failures: 0, Errors: 0, Skipped: 0, Time elapsed: 0.004 s - in org.apache.juneau.dto.swagger.HeaderInfoTest
[INFO] Running org.apache.juneau.dto.cognos.CognosXmlTest
[INFO] Tests run: 1, Failures: 0, Errors: 0, Skipped: 0, Time elapsed: 0.032 s - in org.apache.juneau.dto.cognos.CognosXmlTest
[INFO] Running org.apache.juneau.dto.atom.AtomTest
[INFO] Tests run: 4, Failures: 0, Errors: 0, Skipped: 0, Time elapsed: 0.148 s - in org.apache.juneau.dto.atom.AtomTest
[INFO] Running org.apache.juneau.JacocoDummyTest
[INFO] Tests run: 1, Failures: 0, Errors: 0, Skipped: 0, Time elapsed: 0 s - in org.apache.juneau.JacocoDummyTest
[INFO] Running org.apache.juneau.csv.CsvTest
[INFO] Tests run: 1, Failures: 0, Errors: 0, Skipped: 0, Time elapsed: 0.009 s - in org.apache.juneau.csv.CsvTest
[INFO] Running org.apache.juneau.pojotools.PojoViewerTest
[INFO] Tests run: 38, Failures: 0, Errors: 0, Skipped: 0, Time elapsed: 0.016 s - in org.apache.juneau.pojotools.PojoViewerTest
[INFO] Running org.apache.juneau.pojotools.PojoSorterTest
[INFO] Tests run: 24, Failures: 0, Errors: 0, Skipped: 0, Time elapsed: 0.01 s - in org.apache.juneau.pojotools.PojoSorterTest
[INFO] Running org.apache.juneau.pojotools.PojoSearcherTest
[INFO] Tests run: 82, Failures: 0, Errors: 0, Skipped: 0, Time elapsed: 0.107 s - in org.apache.juneau.pojotools.PojoSearcherTest
[INFO] Running org.apache.juneau.svl.ResolvingObjectMapTest
[INFO] Tests run: 4, Failures: 0, Errors: 0, Skipped: 0, Time elapsed: 0.005 s - in org.apache.juneau.svl.ResolvingObjectMapTest
[INFO] Running org.apache.juneau.svl.vars.PatternExtractVarTest
[INFO] Tests run: 1, Failures: 0, Errors: 0, Skipped: 0, Time elapsed: 0 s - in org.apache.juneau.svl.vars.PatternExtractVarTest
[INFO] Running org.apache.juneau.svl.vars.LowerCaseVarTest
[INFO] Tests run: 1, Failures: 0, Errors: 0, Skipped: 0, Time elapsed: 0 s - in org.apache.juneau.svl.vars.LowerCaseVarTest
[INFO] Running org.apache.juneau.svl.vars.SubstringVarTest
[INFO] Tests run: 1, Failures: 0, Errors: 0, Skipped: 0, Time elapsed: 0 s - in org.apache.juneau.svl.vars.SubstringVarTest
[INFO] Running org.apache.juneau.svl.vars.LenVarTest
[INFO] Tests run: 1, Failures: 0, Errors: 0, Skipped: 0, Time elapsed: 0 s - in org.apache.juneau.svl.vars.LenVarTest
[INFO] Running org.apache.juneau.svl.vars.PatternMatchVarTest
[INFO] Tests run: 1, Failures: 0, Errors: 0, Skipped: 0, Time elapsed: 0 s - in org.apache.juneau.svl.vars.PatternMatchVarTest
[INFO] Running org.apache.juneau.svl.vars.NotEmptyVarTest
[INFO] Tests run: 1, Failures: 0, Errors: 0, Skipped: 0, Time elapsed: 0 s - in org.apache.juneau.svl.vars.NotEmptyVarTest
[INFO] Running org.apache.juneau.svl.vars.IfVarTest
[INFO] Tests run: 1, Failures: 0, Errors: 0, Skipped: 0, Time elapsed: 0 s - in org.apache.juneau.svl.vars.IfVarTest
[INFO] Running org.apache.juneau.svl.vars.PatternReplaceVarTest
[INFO] Tests run: 1, Failures: 0, Errors: 0, Skipped: 0, Time elapsed: 0 s - in org.apache.juneau.svl.vars.PatternReplaceVarTest
[INFO] Running org.apache.juneau.svl.vars.RestrictedVarsTest
[INFO] Tests run: 3, Failures: 0, Errors: 0, Skipped: 0, Time elapsed: 0.006 s - in org.apache.juneau.svl.vars.RestrictedVarsTest
[INFO] Running org.apache.juneau.svl.vars.SwitchVarTest
[INFO] Tests run: 1, Failures: 0, Errors: 0, Skipped: 0, Time elapsed: 0.001 s - in org.apache.juneau.svl.vars.SwitchVarTest
[INFO] Running org.apache.juneau.svl.vars.UpperCaseVarTest
[INFO] Tests run: 1, Failures: 0, Errors: 0, Skipped: 0, Time elapsed: 0 s - in org.apache.juneau.svl.vars.UpperCaseVarTest
[INFO] Running org.apache.juneau.ObjectMapTest
[INFO] Tests run: 8, Failures: 0, Errors: 0, Skipped: 0, Time elapsed: 0.009 s - in org.apache.juneau.ObjectMapTest
[INFO] Running org.apache.juneau.VisibilityTest
[INFO] Tests run: 1, Failures: 0, Errors: 0, Skipped: 0, Time elapsed: 0.252 s - in org.apache.juneau.VisibilityTest
[INFO] Running org.apache.juneau.ValueTest
[INFO] Tests run: 3, Failures: 0, Errors: 0, Skipped: 0, Time elapsed: 0.004 s - in org.apache.juneau.ValueTest
[INFO] Running org.apache.juneau.marshall.XmlTest
[INFO] Tests run: 5, Failures: 0, Errors: 0, Skipped: 0, Time elapsed: 0.003 s - in org.apache.juneau.marshall.XmlTest
[INFO] Running org.apache.juneau.marshall.NTripleTest
[INFO] Tests run: 4, Failures: 0, Errors: 0, Skipped: 0, Time elapsed: 0.002 s - in org.apache.juneau.marshall.NTripleTest
[INFO] Running org.apache.juneau.marshall.JsonTest
[INFO] Tests run: 5, Failures: 0, Errors: 0, Skipped: 0, Time elapsed: 0 s - in org.apache.juneau.marshall.JsonTest
[INFO] Running org.apache.juneau.marshall.RdfXmlAbbrevTest
[INFO] Tests run: 4, Failures: 0, Errors: 0, Skipped: 0, Time elapsed: 0.001 s - in org.apache.juneau.marshall.RdfXmlAbbrevTest
[INFO] Running org.apache.juneau.marshall.PlainTextTest
[INFO] Tests run: 4, Failures: 0, Errors: 0, Skipped: 0, Time elapsed: 0.006 s - in org.apache.juneau.marshall.PlainTextTest
[INFO] Running org.apache.juneau.marshall.HtmlTest
[INFO] Tests run: 5, Failures: 0, Errors: 0, Skipped: 0, Time elapsed: 0 s - in org.apache.juneau.marshall.HtmlTest
[INFO] Running org.apache.juneau.marshall.SimpleJsonTest
[INFO] Tests run: 5, Failures: 0, Errors: 0, Skipped: 0, Time elapsed: 0 s - in org.apache.juneau.marshall.SimpleJsonTest
[INFO] Running org.apache.juneau.marshall.N3Test
[INFO] Tests run: 4, Failures: 0, Errors: 0, Skipped: 0, Time elapsed: 0.004 s - in org.apache.juneau.marshall.N3Test
[INFO] Running org.apache.juneau.marshall.RdfXmlTest
[INFO] Tests run: 4, Failures: 0, Errors: 0, Skipped: 0, Time elapsed: 0.006 s - in org.apache.juneau.marshall.RdfXmlTest
[INFO] Running org.apache.juneau.marshall.UrlEncodingTest
[INFO] Tests run: 5, Failures: 0, Errors: 0, Skipped: 0, Time elapsed: 0 s - in org.apache.juneau.marshall.UrlEncodingTest
[INFO] Running org.apache.juneau.marshall.MsgPackTest
[INFO] Tests run: 5, Failures: 0, Errors: 0, Skipped: 0, Time elapsed: 0 s - in org.apache.juneau.marshall.MsgPackTest
[INFO] Running org.apache.juneau.marshall.JsoTest
[INFO] Tests run: 1, Failures: 0, Errors: 0, Skipped: 0, Time elapsed: 0.024 s - in org.apache.juneau.marshall.JsoTest
[INFO] Running org.apache.juneau.marshall.TurtleTest
[INFO] Tests run: 4, Failures: 0, Errors: 0, Skipped: 0, Time elapsed: 0.001 s - in org.apache.juneau.marshall.TurtleTest
[INFO] Running org.apache.juneau.marshall.UonTest
[INFO] Tests run: 5, Failures: 0, Errors: 0, Skipped: 0, Time elapsed: 0.001 s - in org.apache.juneau.marshall.UonTest
[INFO] Running org.apache.juneau.DynaBeanComboTest
[INFO] Tests run: 390, Failures: 0, Errors: 0, Skipped: 0, Time elapsed: 0.34 s - in org.apache.juneau.DynaBeanComboTest
[INFO] Running org.apache.juneau.PojoExamplesTest
[INFO] Tests run: 9, Failures: 0, Errors: 0, Skipped: 0, Time elapsed: 0.02 s - in org.apache.juneau.PojoExamplesTest
[INFO] Running org.apache.juneau.http.annotation.AnnotationUtilsTest
[INFO] Tests run: 7, Failures: 0, Errors: 0, Skipped: 0, Time elapsed: 0.086 s - in org.apache.juneau.http.annotation.AnnotationUtilsTest
[INFO] Running org.apache.juneau.json.CommonParserTest
[INFO] Tests run: 4, Failures: 0, Errors: 0, Skipped: 0, Time elapsed: 0.085 s - in org.apache.juneau.json.CommonParserTest
[INFO] Running org.apache.juneau.json.JsonSchemaSerializerTest
[INFO] Tests run: 1, Failures: 0, Errors: 0, Skipped: 0, Time elapsed: 0 s - in org.apache.juneau.json.JsonSchemaSerializerTest
[INFO] Running org.apache.juneau.json.JsonTest
[INFO] Tests run: 10, Failures: 0, Errors: 0, Skipped: 0, Time elapsed: 0.053 s - in org.apache.juneau.json.JsonTest
[INFO] Running org.apache.juneau.json.CommonTest
[INFO] Tests run: 9, Failures: 0, Errors: 0, Skipped: 0, Time elapsed: 0.044 s - in org.apache.juneau.json.CommonTest
[INFO] Running org.apache.juneau.json.JsonParserTest
[INFO] Tests run: 9, Failures: 0, Errors: 0, Skipped: 0, Time elapsed: 0.01 s - in org.apache.juneau.json.JsonParserTest
[INFO] Running org.apache.juneau.json.JsonParserEdgeCasesTest
[INFO] Tests run: 636, Failures: 0, Errors: 0, Skipped: 0, Time elapsed: 0.2 s - in org.apache.juneau.json.JsonParserEdgeCasesTest
[INFO] Running org.apache.juneau.BeanMapErrorsTest
[INFO] Tests run: 2, Failures: 0, Errors: 0, Skipped: 0, Time elapsed: 0.001 s - in org.apache.juneau.BeanMapErrorsTest
[INFO] Running org.apache.juneau.xml.CommonParserTest
[INFO] Tests run: 4, Failures: 0, Errors: 0, Skipped: 0, Time elapsed: 0.006 s - in org.apache.juneau.xml.CommonParserTest
[INFO] Running org.apache.juneau.xml.XmlTest
[INFO] Tests run: 27, Failures: 0, Errors: 0, Skipped: 0, Time elapsed: 0.241 s - in org.apache.juneau.xml.XmlTest
[INFO] Running org.apache.juneau.xml.BasicXmlTest
[INFO] Tests run: 384, Failures: 0, Errors: 0, Skipped: 0, Time elapsed: 0.192 s - in org.apache.juneau.xml.BasicXmlTest
[INFO] Running org.apache.juneau.xml.CommonTest
[INFO] Tests run: 8, Failures: 0, Errors: 0, Skipped: 0, Time elapsed: 0.049 s - in org.apache.juneau.xml.CommonTest
[INFO] Running org.apache.juneau.xml.XmlIgnoreCommentsTest
[INFO] Tests run: 248, Failures: 0, Errors: 0, Skipped: 0, Time elapsed: 0.195 s - in org.apache.juneau.xml.XmlIgnoreCommentsTest
[INFO] Running org.apache.juneau.xml.XmlCollapsedTest
[INFO] Tests run: 9, Failures: 0, Errors: 0, Skipped: 0, Time elapsed: 0.049 s - in org.apache.juneau.xml.XmlCollapsedTest
[INFO] Running org.apache.juneau.xml.InvalidXmlBeansTest
[INFO] Tests run: 15, Failures: 0, Errors: 0, Skipped: 0, Time elapsed: 0.019 s - in org.apache.juneau.xml.InvalidXmlBeansTest
[INFO] Running org.apache.juneau.xml.XmlContentTest
[INFO] Tests run: 2, Failures: 0, Errors: 0, Skipped: 0, Time elapsed: 0.01 s - in org.apache.juneau.xml.XmlContentTest
[INFO] Running org.apache.juneau.xml.XmlParserTest
[INFO] Tests run: 3, Failures: 0, Errors: 0, Skipped: 0, Time elapsed: 0.003 s - in org.apache.juneau.xml.XmlParserTest
[INFO] Running org.apache.juneau.xml.CommonXmlTest
[INFO] Tests run: 2, Failures: 0, Errors: 0, Skipped: 0, Time elapsed: 0.004 s - in org.apache.juneau.xml.CommonXmlTest
[INFO] Running org.apache.juneau.https.ContentTypeTest
[INFO] Tests run: 21, Failures: 0, Errors: 0, Skipped: 0, Time elapsed: 0.008 s - in org.apache.juneau.https.ContentTypeTest
[INFO] Running org.apache.juneau.https.MediaRangeTest
[INFO] Tests run: 17, Failures: 0, Errors: 0, Skipped: 0, Time elapsed: 0.003 s - in org.apache.juneau.https.MediaRangeTest
[INFO] Running org.apache.juneau.https.AcceptExtensionsTest
[INFO] Tests run: 2, Failures: 0, Errors: 0, Skipped: 0, Time elapsed: 0.001 s - in org.apache.juneau.https.AcceptExtensionsTest
[INFO] Running org.apache.juneau.https.AcceptTest
[INFO] Tests run: 146, Failures: 0, Errors: 0, Skipped: 0, Time elapsed: 0.025 s - in org.apache.juneau.https.AcceptTest
[INFO] Running org.apache.juneau.encoders.EncoderGroupTest
[INFO] Tests run: 2, Failures: 0, Errors: 0, Skipped: 0, Time elapsed: 0.008 s - in org.apache.juneau.encoders.EncoderGroupTest
[INFO] Running org.apache.juneau.annotation.BeanIgnoreTest
[INFO] Tests run: 1, Failures: 0, Errors: 0, Skipped: 0, Time elapsed: 0 s - in org.apache.juneau.annotation.BeanIgnoreTest
[INFO] Running org.apache.juneau.msgpack.MsgPackSerializerTest
[INFO] Tests run: 1, Failures: 0, Errors: 0, Skipped: 0, Time elapsed: 0.001 s - in org.apache.juneau.msgpack.MsgPackSerializerTest
[INFO] Running org.apache.juneau.msgpack.MsgPackParserTest
[INFO] Tests run: 2, Failures: 0, Errors: 0, Skipped: 0, Time elapsed: 0.003 s - in org.apache.juneau.msgpack.MsgPackParserTest
[INFO] Running org.apache.juneau.httppart.UonPartParserTest
[INFO] Tests run: 4, Failures: 0, Errors: 0, Skipped: 0, Time elapsed: 0.003 s - in org.apache.juneau.httppart.UonPartParserTest
[INFO] Running org.apache.juneau.httppart.OpenApiPartParserTest
[INFO] Tests run: 55, Failures: 0, Errors: 0, Skipped: 0, Time elapsed: 0.187 s - in org.apache.juneau.httppart.OpenApiPartParserTest
[INFO] Running org.apache.juneau.httppart.OpenApiPartSerializerTest
[INFO] Tests run: 69, Failures: 0, Errors: 0, Skipped: 0, Time elapsed: 0.124 s - in org.apache.juneau.httppart.OpenApiPartSerializerTest
[INFO] Running org.apache.juneau.MaxIndentTest
[INFO] Tests run: 70, Failures: 0, Errors: 0, Skipped: 0, Time elapsed: 0.047 s - in org.apache.juneau.MaxIndentTest
[INFO] Running org.apache.juneau.parser.ParserGroupTest
[INFO] Tests run: 2, Failures: 0, Errors: 0, Skipped: 0, Time elapsed: 0.008 s - in org.apache.juneau.parser.ParserGroupTest
[INFO] Running org.apache.juneau.ContextCacheTest
[INFO] Tests run: 2, Failures: 0, Errors: 0, Skipped: 0, Time elapsed: 0.017 s - in org.apache.juneau.ContextCacheTest
[INFO] Running org.apache.juneau.urlencoding.Common_UrlEncodingTest
[INFO] Tests run: 8, Failures: 0, Errors: 0, Skipped: 0, Time elapsed: 0.032 s - in org.apache.juneau.urlencoding.Common_UrlEncodingTest
[INFO] Running org.apache.juneau.urlencoding.UrlEncodingSerializerTest
[INFO] Tests run: 6, Failures: 0, Errors: 0, Skipped: 0, Time elapsed: 0.026 s - in org.apache.juneau.urlencoding.UrlEncodingSerializerTest
[INFO] Running org.apache.juneau.urlencoding.CommonParser_UrlEncodingTest
[INFO] Tests run: 5, Failures: 0, Errors: 0, Skipped: 0, Time elapsed: 0.048 s - in org.apache.juneau.urlencoding.CommonParser_UrlEncodingTest
[INFO] Running org.apache.juneau.urlencoding.UrlEncodingParserTest
[INFO] Tests run: 9, Failures: 0, Errors: 0, Skipped: 0, Time elapsed: 0.027 s - in org.apache.juneau.urlencoding.UrlEncodingParserTest
[INFO] Running org.apache.juneau.BeanConfigTest
[INFO] Tests run: 11, Failures: 0, Errors: 0, Skipped: 0, Time elapsed: 0.218 s - in org.apache.juneau.BeanConfigTest
[INFO] Running org.apache.juneau.ParserGenericsTest
[INFO] Tests run: 2, Failures: 0, Errors: 0, Skipped: 0, Time elapsed: 0.021 s - in org.apache.juneau.ParserGenericsTest
[INFO] 
[INFO] Results:
[INFO] 
[ERROR] Errors: 
[ERROR]   PropertyStoreTest.testMapObjectHash:1412->testNotEquals:1778 ยป Runtime Propert...
[INFO] 
[ERROR] Tests run: 18799, Failures: 0, Errors: 1, Skipped: 2
[INFO] 
[INFO]                                                                         
[INFO] ------------------------------------------------------------------------
[INFO] Skipping Apache Juneau
[INFO] This project has been banned from the build due to previous failures.
[INFO] ------------------------------------------------------------------------
[INFO] ------------------------------------------------------------------------
[INFO] Reactor Summary:
[INFO] 
[INFO] Apache Juneau ...................................... SUCCESS [  8.565 s]
[INFO] Apache Juneau - Core APIs .......................... SUCCESS [  4.253 s]
[INFO] Apache Juneau Marshall ............................. SUCCESS [ 42.262 s]
[INFO] Apache Juneau Marshal RDF .......................... SUCCESS [ 12.984 s]
[INFO] Apache Juneau Data Transfer Objects ................ SUCCESS [ 15.106 s]
[INFO] Apache Juneau Core ................................. SUCCESS [ 11.517 s]
[INFO] Apache Juneau Config File API ...................... SUCCESS [ 11.523 s]
[INFO] Apache Juneau Core Tests ........................... FAILURE [ 40.687 s]
[INFO] Apache Juneau - REST APIs .......................... SKIPPED
[INFO] Apache Juneau REST Servlet API ..................... SKIPPED
[INFO] Apache Juneau REST JAX/RS API ...................... SKIPPED
[INFO] Apache Juneau REST Servlet API, RDF support ........ SKIPPED
[INFO] Apache Juneau REST Spring Boot Integration ......... SKIPPED
[INFO] Apache Juneau REST Client API ...................... SKIPPED
[INFO] Apache Juneau REST Mock API ........................ SKIPPED
[INFO] Apache Juneau REST Servlet API - Tests ............. SKIPPED
[INFO] Apache Juneau REST Client API - Tests .............. SKIPPED
[INFO] Apache Juneau - Microservice APIs .................. SKIPPED
[INFO] Apache Juneau Microservice Core Library ............ SKIPPED
[INFO] Apache Juneau Microservice Server .................. SKIPPED
[INFO] Apache Juneau Jetty Microservice Template .......... SKIPPED
[INFO] Apache Juneau - Examples ........................... SKIPPED
[INFO] Apache Juneau REST Examples ........................ SKIPPED
[INFO] Apache Juneau Microservice Tests ................... SKIPPED
[INFO] Apache Juneau Spring Boot Microservice Template .... SKIPPED
[INFO] Apache Juneau Core Examples ........................ SKIPPED
[INFO] Apache Juneau REST Examples using Jetty ............ SKIPPED
[INFO] Apache Juneau REST Examples using Spring Boot ...... SKIPPED
[INFO] Apache Juneau Javadocs ............................. SKIPPED
[INFO] Apache Juneau - Release Engineering ................ SKIPPED
[INFO] Apache Juneau UberJar .............................. SKIPPED
[INFO] Apache Juneau Distribution ......................... SKIPPED
[INFO] ------------------------------------------------------------------------
[INFO] BUILD FAILURE
[INFO] ------------------------------------------------------------------------
[INFO] Total time: 02:28 min
[INFO] Finished at: 2019-03-31T14:05:54+00:00
[INFO] Final Memory: 77M/2159M
[INFO] ------------------------------------------------------------------------
[ERROR] Failed to execute goal org.apache.maven.plugins:maven-surefire-plugin:2.22.0:test
(default-test) on project juneau-core-test: There are test failures.
[ERROR] 
[ERROR] Please refer to <https://builds.apache.org/job/Juneau-Java-1.8/ws/juneau-core/juneau-core-test/target/surefire-reports>
for the individual test results.
[ERROR] Please refer to dump files (if any exist) [date]-jvmRun[N].dump, [date].dumpstream
and [date]-jvmRun[N].dumpstream.
[ERROR] -> [Help 1]
[ERROR] 
[ERROR] To see the full stack trace of the errors, re-run Maven with the -e switch.
[ERROR] Re-run Maven using the -X switch to enable full debug logging.
[ERROR] 
[ERROR] For more information about the errors and possible solutions, please read the following
articles:
[ERROR] [Help 1] http://cwiki.apache.org/confluence/display/MAVEN/MojoFailureException
[ERROR] 
[ERROR] After correcting the problems, you can resume the build with the command
[ERROR]   mvn <goals> -rf :juneau-core-test
Build step 'Invoke top-level Maven targets' marked build as failure
Recording test results
[TASKS] Skipping publisher since build result is FAILURE

Mime
View raw message