juneau-dev mailing list archives

Site index · List index
Message view « Date » · « Thread »
Top « Date » · « Thread »
From Apache Jenkins Server <jenk...@builds.apache.org>
Subject Build failed in Jenkins: Juneau-Java-1.8 #1168
Date Fri, 07 Dec 2018 15:16:56 GMT
See <https://builds.apache.org/job/Juneau-Java-1.8/1168/display/redirect?page=changes>

Changes:

[JamesBognar] Revamp of Microservice API for Spring Boot support.

------------------------------------------
[...truncated 190.92 KB...]
[INFO] Tests run: 31, Failures: 0, Errors: 0, Skipped: 0, Time elapsed: 0.006 s - in org.apache.juneau.dto.swagger.SwaggerBuilderTest
[INFO] Running org.apache.juneau.dto.swagger.ResponseInfoTest
[INFO] Tests run: 11, Failures: 0, Errors: 0, Skipped: 0, Time elapsed: 0.008 s - in org.apache.juneau.dto.swagger.ResponseInfoTest
[INFO] Running org.apache.juneau.dto.swagger.InfoTest
[INFO] Tests run: 7, Failures: 0, Errors: 0, Skipped: 0, Time elapsed: 0.002 s - in org.apache.juneau.dto.swagger.InfoTest
[INFO] Running org.apache.juneau.dto.swagger.OperationTest
[INFO] Tests run: 29, Failures: 0, Errors: 0, Skipped: 0, Time elapsed: 0.014 s - in org.apache.juneau.dto.swagger.OperationTest
[INFO] Running org.apache.juneau.dto.html5.Html5TemplateComboTest
[INFO] Tests run: 65, Failures: 0, Errors: 0, Skipped: 0, Time elapsed: 0.861 s - in org.apache.juneau.dto.html5.Html5TemplateComboTest
[INFO] Running org.apache.juneau.dto.html5.Html5ComboTest
[INFO] Tests run: 4550, Failures: 0, Errors: 0, Skipped: 0, Time elapsed: 5.141 s - in org.apache.juneau.dto.html5.Html5ComboTest
[INFO] Running org.apache.juneau.dto.html5.Html5BasicTest
[INFO] Tests run: 1, Failures: 0, Errors: 0, Skipped: 0, Time elapsed: 0.001 s - in org.apache.juneau.dto.html5.Html5BasicTest
[INFO] Running org.apache.juneau.dto.cognos.CognosXmlTest
[INFO] Tests run: 1, Failures: 0, Errors: 0, Skipped: 0, Time elapsed: 0 s - in org.apache.juneau.dto.cognos.CognosXmlTest
[INFO] Running org.apache.juneau.BeanConfigTest
[INFO] Tests run: 11, Failures: 0, Errors: 0, Skipped: 0, Time elapsed: 0.033 s - in org.apache.juneau.BeanConfigTest
[INFO] Running org.apache.juneau.BeanMapErrorsTest
[INFO] Tests run: 2, Failures: 0, Errors: 0, Skipped: 0, Time elapsed: 0.001 s - in org.apache.juneau.BeanMapErrorsTest
[INFO] Running org.apache.juneau.parser.ParserGroupTest
[INFO] Tests run: 2, Failures: 0, Errors: 0, Skipped: 0, Time elapsed: 0.016 s - in org.apache.juneau.parser.ParserGroupTest
[INFO] Running org.apache.juneau.https.AcceptTest
[INFO] Tests run: 146, Failures: 0, Errors: 0, Skipped: 0, Time elapsed: 0.043 s - in org.apache.juneau.https.AcceptTest
[INFO] Running org.apache.juneau.https.MediaRangeTest
[INFO] Tests run: 17, Failures: 0, Errors: 0, Skipped: 0, Time elapsed: 0.005 s - in org.apache.juneau.https.MediaRangeTest
[INFO] Running org.apache.juneau.https.AcceptExtensionsTest
[INFO] Tests run: 2, Failures: 0, Errors: 0, Skipped: 0, Time elapsed: 0.001 s - in org.apache.juneau.https.AcceptExtensionsTest
[INFO] Running org.apache.juneau.https.ContentTypeTest
[INFO] Tests run: 21, Failures: 0, Errors: 0, Skipped: 0, Time elapsed: 0.01 s - in org.apache.juneau.https.ContentTypeTest
[INFO] Running org.apache.juneau.transforms.BuilderComboTest
[INFO] Tests run: 390, Failures: 0, Errors: 0, Skipped: 0, Time elapsed: 0.359 s - in org.apache.juneau.transforms.BuilderComboTest
[INFO] Running org.apache.juneau.transforms.BeanFilterTest
[INFO] Tests run: 6, Failures: 0, Errors: 0, Skipped: 0, Time elapsed: 0.017 s - in org.apache.juneau.transforms.BeanFilterTest
[INFO] Running org.apache.juneau.transforms.DateSwapTest
[INFO] Tests run: 1, Failures: 0, Errors: 0, Skipped: 0, Time elapsed: 0.007 s - in org.apache.juneau.transforms.DateSwapTest
[INFO] Running org.apache.juneau.transforms.DateSwapComboTest
[INFO] Tests run: 1170, Failures: 0, Errors: 0, Skipped: 0, Time elapsed: 1.326 s - in org.apache.juneau.transforms.DateSwapComboTest
[INFO] Running org.apache.juneau.transforms.SwapsAnnotationComboTest
[INFO] Tests run: 336, Failures: 0, Errors: 0, Skipped: 0, Time elapsed: 0.162 s - in org.apache.juneau.transforms.SwapsAnnotationComboTest
[INFO] Running org.apache.juneau.transforms.CalendarSwapComboTest
[INFO] Tests run: 1170, Failures: 0, Errors: 0, Skipped: 0, Time elapsed: 1.148 s - in org.apache.juneau.transforms.CalendarSwapComboTest
[INFO] Running org.apache.juneau.transforms.LocalizedDatesTest
[INFO] Tests run: 460, Failures: 0, Errors: 0, Skipped: 0, Time elapsed: 0.613 s - in org.apache.juneau.transforms.LocalizedDatesTest
[INFO] Running org.apache.juneau.transforms.PojoSwapTest
[INFO] Tests run: 1, Failures: 0, Errors: 0, Skipped: 0, Time elapsed: 0 s - in org.apache.juneau.transforms.PojoSwapTest
[INFO] Running org.apache.juneau.transforms.BeanMapTest
[INFO] Tests run: 2, Failures: 0, Errors: 0, Skipped: 0, Time elapsed: 0.006 s - in org.apache.juneau.transforms.BeanMapTest
[INFO] Running org.apache.juneau.transforms.ReaderObjectSwapTest
[INFO] Tests run: 231, Failures: 0, Errors: 0, Skipped: 0, Time elapsed: 0.13 s - in org.apache.juneau.transforms.ReaderObjectSwapTest
[INFO] Running org.apache.juneau.transforms.EnumerationSwapTest
[INFO] Tests run: 1, Failures: 0, Errors: 0, Skipped: 0, Time elapsed: 0 s - in org.apache.juneau.transforms.EnumerationSwapTest
[INFO] Running org.apache.juneau.transforms.ByteArrayBase64SwapComboTest
[INFO] Tests run: 715, Failures: 0, Errors: 0, Skipped: 0, Time elapsed: 0.741 s - in org.apache.juneau.transforms.ByteArrayBase64SwapComboTest
[INFO] Running org.apache.juneau.transforms.BeanDictionaryComboTest
[INFO] Tests run: 1560, Failures: 0, Errors: 0, Skipped: 0, Time elapsed: 2.182 s - in org.apache.juneau.transforms.BeanDictionaryComboTest
[INFO] Running org.apache.juneau.transforms.ReaderFilterTest
[INFO] Tests run: 6, Failures: 0, Errors: 0, Skipped: 0, Time elapsed: 0.001 s - in org.apache.juneau.transforms.ReaderFilterTest
[INFO] Running org.apache.juneau.transforms.CalendarSwapTest
[INFO] Tests run: 7, Failures: 0, Errors: 0, Skipped: 0, Time elapsed: 0.003 s - in org.apache.juneau.transforms.CalendarSwapTest
[INFO] Running org.apache.juneau.transforms.IteratorSwapTest
[INFO] Tests run: 1, Failures: 0, Errors: 0, Skipped: 0, Time elapsed: 0 s - in org.apache.juneau.transforms.IteratorSwapTest
[INFO] Running org.apache.juneau.AnnotationsTest
[INFO] Tests run: 2, Failures: 0, Errors: 0, Skipped: 0, Time elapsed: 0.001 s - in org.apache.juneau.AnnotationsTest
[INFO] Running org.apache.juneau.svl.ResolvingObjectMapTest
[INFO] Tests run: 4, Failures: 0, Errors: 0, Skipped: 0, Time elapsed: 0.007 s - in org.apache.juneau.svl.ResolvingObjectMapTest
[INFO] Running org.apache.juneau.svl.vars.RestrictedVarsTest
[INFO] Tests run: 3, Failures: 0, Errors: 0, Skipped: 0, Time elapsed: 0.003 s - in org.apache.juneau.svl.vars.RestrictedVarsTest
[INFO] Running org.apache.juneau.svl.vars.PatternExtractVarTest
[INFO] Tests run: 1, Failures: 0, Errors: 0, Skipped: 0, Time elapsed: 0 s - in org.apache.juneau.svl.vars.PatternExtractVarTest
[INFO] Running org.apache.juneau.svl.vars.IfVarTest
[INFO] Tests run: 1, Failures: 0, Errors: 0, Skipped: 0, Time elapsed: 0 s - in org.apache.juneau.svl.vars.IfVarTest
[INFO] Running org.apache.juneau.svl.vars.SwitchVarTest
[INFO] Tests run: 1, Failures: 0, Errors: 0, Skipped: 0, Time elapsed: 0 s - in org.apache.juneau.svl.vars.SwitchVarTest
[INFO] Running org.apache.juneau.svl.vars.UpperCaseVarTest
[INFO] Tests run: 1, Failures: 0, Errors: 0, Skipped: 0, Time elapsed: 0 s - in org.apache.juneau.svl.vars.UpperCaseVarTest
[INFO] Running org.apache.juneau.svl.vars.PatternMatchVarTest
[INFO] Tests run: 1, Failures: 0, Errors: 0, Skipped: 0, Time elapsed: 0 s - in org.apache.juneau.svl.vars.PatternMatchVarTest
[INFO] Running org.apache.juneau.svl.vars.NotEmptyVarTest
[INFO] Tests run: 1, Failures: 0, Errors: 0, Skipped: 0, Time elapsed: 0 s - in org.apache.juneau.svl.vars.NotEmptyVarTest
[INFO] Running org.apache.juneau.svl.vars.LowerCaseVarTest
[INFO] Tests run: 1, Failures: 0, Errors: 0, Skipped: 0, Time elapsed: 0 s - in org.apache.juneau.svl.vars.LowerCaseVarTest
[INFO] Running org.apache.juneau.svl.vars.SubstringVarTest
[INFO] Tests run: 1, Failures: 0, Errors: 0, Skipped: 0, Time elapsed: 0 s - in org.apache.juneau.svl.vars.SubstringVarTest
[INFO] Running org.apache.juneau.svl.vars.LenVarTest
[INFO] Tests run: 1, Failures: 0, Errors: 0, Skipped: 0, Time elapsed: 0 s - in org.apache.juneau.svl.vars.LenVarTest
[INFO] Running org.apache.juneau.svl.vars.PatternReplaceVarTest
[INFO] Tests run: 1, Failures: 0, Errors: 0, Skipped: 0, Time elapsed: 0 s - in org.apache.juneau.svl.vars.PatternReplaceVarTest
[INFO] Running org.apache.juneau.serializer.ReaderObjectComboTest
[INFO] Tests run: 189, Failures: 0, Errors: 0, Skipped: 0, Time elapsed: 0.087 s - in org.apache.juneau.serializer.ReaderObjectComboTest
[INFO] Running org.apache.juneau.serializer.UriResolutionTest
[INFO] Tests run: 390, Failures: 0, Errors: 0, Skipped: 0, Time elapsed: 0.39 s - in org.apache.juneau.serializer.UriResolutionTest
[INFO] Running org.apache.juneau.serializer.SerializerGroupTest
[INFO] Tests run: 3, Failures: 0, Errors: 0, Skipped: 0, Time elapsed: 0 s - in org.apache.juneau.serializer.SerializerGroupTest
[INFO] Running org.apache.juneau.internal.VersionRangeTest
[INFO] Tests run: 22, Failures: 0, Errors: 0, Skipped: 0, Time elapsed: 0.001 s - in org.apache.juneau.internal.VersionRangeTest
[INFO] Running org.apache.juneau.marshall.RdfXmlAbbrevTest
[INFO] Tests run: 4, Failures: 0, Errors: 0, Skipped: 0, Time elapsed: 0.002 s - in org.apache.juneau.marshall.RdfXmlAbbrevTest
[INFO] Running org.apache.juneau.marshall.UonTest
[INFO] Tests run: 5, Failures: 0, Errors: 0, Skipped: 0, Time elapsed: 0 s - in org.apache.juneau.marshall.UonTest
[INFO] Running org.apache.juneau.marshall.XmlTest
[INFO] Tests run: 5, Failures: 0, Errors: 0, Skipped: 0, Time elapsed: 0.001 s - in org.apache.juneau.marshall.XmlTest
[INFO] Running org.apache.juneau.marshall.NTripleTest
[INFO] Tests run: 4, Failures: 0, Errors: 0, Skipped: 0, Time elapsed: 0.012 s - in org.apache.juneau.marshall.NTripleTest
[INFO] Running org.apache.juneau.marshall.JsonTest
[INFO] Tests run: 5, Failures: 0, Errors: 0, Skipped: 0, Time elapsed: 0 s - in org.apache.juneau.marshall.JsonTest
[INFO] Running org.apache.juneau.marshall.HtmlTest
[INFO] Tests run: 5, Failures: 0, Errors: 0, Skipped: 0, Time elapsed: 0 s - in org.apache.juneau.marshall.HtmlTest
[INFO] Running org.apache.juneau.marshall.SimpleJsonTest
[INFO] Tests run: 5, Failures: 0, Errors: 0, Skipped: 0, Time elapsed: 0 s - in org.apache.juneau.marshall.SimpleJsonTest
[INFO] Running org.apache.juneau.marshall.N3Test
[INFO] Tests run: 4, Failures: 0, Errors: 0, Skipped: 0, Time elapsed: 0.039 s - in org.apache.juneau.marshall.N3Test
[INFO] Running org.apache.juneau.marshall.UrlEncodingTest
[INFO] Tests run: 5, Failures: 0, Errors: 0, Skipped: 0, Time elapsed: 0 s - in org.apache.juneau.marshall.UrlEncodingTest
[INFO] Running org.apache.juneau.marshall.JsoTest
[INFO] Tests run: 1, Failures: 0, Errors: 0, Skipped: 0, Time elapsed: 0.015 s - in org.apache.juneau.marshall.JsoTest
[INFO] Running org.apache.juneau.marshall.MsgPackTest
[INFO] Tests run: 5, Failures: 0, Errors: 0, Skipped: 0, Time elapsed: 0 s - in org.apache.juneau.marshall.MsgPackTest
[INFO] Running org.apache.juneau.marshall.PlainTextTest
[INFO] Tests run: 4, Failures: 0, Errors: 0, Skipped: 0, Time elapsed: 0.003 s - in org.apache.juneau.marshall.PlainTextTest
[INFO] Running org.apache.juneau.marshall.TurtleTest
[INFO] Tests run: 4, Failures: 0, Errors: 0, Skipped: 0, Time elapsed: 0.004 s - in org.apache.juneau.marshall.TurtleTest
[INFO] Running org.apache.juneau.marshall.RdfXmlTest
[INFO] Tests run: 4, Failures: 0, Errors: 0, Skipped: 0, Time elapsed: 0.006 s - in org.apache.juneau.marshall.RdfXmlTest
[INFO] Running org.apache.juneau.msgpack.MsgPackParserTest
[INFO] Tests run: 2, Failures: 0, Errors: 0, Skipped: 0, Time elapsed: 0 s - in org.apache.juneau.msgpack.MsgPackParserTest
[INFO] Running org.apache.juneau.msgpack.MsgPackSerializerTest
[INFO] Tests run: 1, Failures: 0, Errors: 0, Skipped: 0, Time elapsed: 0 s - in org.apache.juneau.msgpack.MsgPackSerializerTest
[INFO] Running org.apache.juneau.MaxIndentTest
[INFO] Tests run: 70, Failures: 0, Errors: 0, Skipped: 0, Time elapsed: 0.019 s - in org.apache.juneau.MaxIndentTest
[INFO] Running org.apache.juneau.a.rttests.RoundTripBeanInheritanceTest
[INFO] Tests run: 44, Failures: 0, Errors: 0, Skipped: 0, Time elapsed: 0.125 s - in org.apache.juneau.a.rttests.RoundTripBeanInheritanceTest
[INFO] Running org.apache.juneau.a.rttests.RoundTripNumericConstructorsTest
[INFO] Tests run: 22, Failures: 0, Errors: 0, Skipped: 0, Time elapsed: 0.016 s - in org.apache.juneau.a.rttests.RoundTripNumericConstructorsTest
[INFO] Running org.apache.juneau.a.rttests.RoundTripPrimitiveObjectBeansTest
[INFO] Tests run: 44, Failures: 0, Errors: 0, Skipped: 0, Time elapsed: 0.859 s - in org.apache.juneau.a.rttests.RoundTripPrimitiveObjectBeansTest
[INFO] Running org.apache.juneau.a.rttests.RoundTripTransformBeansTest
[INFO] Tests run: 198, Failures: 0, Errors: 0, Skipped: 0, Time elapsed: 0.361 s - in org.apache.juneau.a.rttests.RoundTripTransformBeansTest
[INFO] Running org.apache.juneau.a.rttests.RoundTripPrimitivesBeansTest
[INFO] Tests run: 44, Failures: 0, Errors: 0, Skipped: 0, Time elapsed: 0.611 s - in org.apache.juneau.a.rttests.RoundTripPrimitivesBeansTest
[INFO] Running org.apache.juneau.a.rttests.RoundTripReadOnlyBeansTest
[INFO] Tests run: 22, Failures: 0, Errors: 0, Skipped: 0, Time elapsed: 0.047 s - in org.apache.juneau.a.rttests.RoundTripReadOnlyBeansTest
[INFO] Running org.apache.juneau.a.rttests.RoundTripGenericsTest
[INFO] Tests run: 22, Failures: 0, Errors: 0, Skipped: 0, Time elapsed: 0.058 s - in org.apache.juneau.a.rttests.RoundTripGenericsTest
[INFO] Running org.apache.juneau.a.rttests.RoundTripSimpleObjectsTest
[INFO] Tests run: 1188, Failures: 0, Errors: 0, Skipped: 0, Time elapsed: 1.177 s - in org.apache.juneau.a.rttests.RoundTripSimpleObjectsTest
[INFO] Running org.apache.juneau.a.rttests.RoundTripDTOsTest
[INFO] Tests run: 44, Failures: 0, Errors: 0, Skipped: 0, Time elapsed: 0.459 s - in org.apache.juneau.a.rttests.RoundTripDTOsTest
[INFO] Running org.apache.juneau.a.rttests.RoundTripToObjectMapsTest
[INFO] Tests run: 22, Failures: 0, Errors: 0, Skipped: 0, Time elapsed: 0.076 s - in org.apache.juneau.a.rttests.RoundTripToObjectMapsTest
[INFO] Running org.apache.juneau.a.rttests.RoundTripLargeObjectsTest
[WARNING] Tests run: 1, Failures: 0, Errors: 0, Skipped: 1, Time elapsed: 0 s - in org.apache.juneau.a.rttests.RoundTripLargeObjectsTest
[INFO] Running org.apache.juneau.a.rttests.RoundTripObjectsAsStringsTest
[INFO] Tests run: 66, Failures: 0, Errors: 0, Skipped: 0, Time elapsed: 0.118 s - in org.apache.juneau.a.rttests.RoundTripObjectsAsStringsTest
[INFO] Running org.apache.juneau.a.rttests.RoundTripAddClassAttrsTest
[INFO] Tests run: 70, Failures: 0, Errors: 0, Skipped: 0, Time elapsed: 0.234 s - in org.apache.juneau.a.rttests.RoundTripAddClassAttrsTest
[INFO] Running org.apache.juneau.a.rttests.RoundTripTrimStringsTest
[INFO] Tests run: 22, Failures: 0, Errors: 0, Skipped: 0, Time elapsed: 0.098 s - in org.apache.juneau.a.rttests.RoundTripTrimStringsTest
[INFO] Running org.apache.juneau.a.rttests.RoundTripBeanMapsTest
[INFO] Tests run: 484, Failures: 0, Errors: 0, Skipped: 0, Time elapsed: 0.674 s - in org.apache.juneau.a.rttests.RoundTripBeanMapsTest
[INFO] Running org.apache.juneau.a.rttests.RoundTripClassesTest
[INFO] Tests run: 22, Failures: 0, Errors: 0, Skipped: 0, Time elapsed: 0.038 s - in org.apache.juneau.a.rttests.RoundTripClassesTest
[INFO] Running org.apache.juneau.a.rttests.RoundTripObjectsWithSpecialMethodsTest
[INFO] Tests run: 44, Failures: 0, Errors: 0, Skipped: 0, Time elapsed: 0.055 s - in org.apache.juneau.a.rttests.RoundTripObjectsWithSpecialMethodsTest
[INFO] Running org.apache.juneau.a.rttests.RoundTripMapsTest
[INFO] Tests run: 132, Failures: 0, Errors: 0, Skipped: 0, Time elapsed: 0.224 s - in org.apache.juneau.a.rttests.RoundTripMapsTest
[INFO] Running org.apache.juneau.a.rttests.RoundTripEnumTest
[INFO] Tests run: 176, Failures: 0, Errors: 0, Skipped: 0, Time elapsed: 0.281 s - in org.apache.juneau.a.rttests.RoundTripEnumTest
[INFO] Running org.apache.juneau.uon.UonParserReaderTest
[INFO] Tests run: 1, Failures: 0, Errors: 0, Skipped: 0, Time elapsed: 0.001 s - in org.apache.juneau.uon.UonParserReaderTest
[INFO] Running org.apache.juneau.uon.Common_UonTest
[INFO] Tests run: 8, Failures: 0, Errors: 0, Skipped: 0, Time elapsed: 0.021 s - in org.apache.juneau.uon.Common_UonTest
[INFO] Running org.apache.juneau.uon.CommonParser_UonTest
[INFO] Tests run: 4, Failures: 0, Errors: 0, Skipped: 0, Time elapsed: 0.008 s - in org.apache.juneau.uon.CommonParser_UonTest
[INFO] Running org.apache.juneau.uon.UonParserTest
[INFO] Tests run: 5, Failures: 0, Errors: 0, Skipped: 0, Time elapsed: 0.007 s - in org.apache.juneau.uon.UonParserTest
[INFO] Running org.apache.juneau.uon.UonSerializerTest
[INFO] Tests run: 2, Failures: 0, Errors: 0, Skipped: 0, Time elapsed: 0.004 s - in org.apache.juneau.uon.UonSerializerTest
[INFO] 
[INFO] Results:
[INFO] 
[ERROR] Failures: 
[ERROR]   ConfigTest.testGetCandidateSystemDefaultConfigNames:1745 expected:<['[]test.cfg','juneau.cf...>
but was:<['[Foo.cfg',']test.cfg','juneau.cf...>
[ERROR]   ConfigFileStoreTest.testExists:141
[INFO] 
[ERROR] Tests run: 18412, Failures: 2, Errors: 0, Skipped: 2
[INFO] 
[INFO]                                                                         
[INFO] ------------------------------------------------------------------------
[INFO] Skipping Apache Juneau
[INFO] This project has been banned from the build due to previous failures.
[INFO] ------------------------------------------------------------------------
[INFO] ------------------------------------------------------------------------
[INFO] Reactor Summary:
[INFO] 
[INFO] Apache Juneau ...................................... SUCCESS [  8.799 s]
[INFO] Apache Juneau - Core APIs .......................... SUCCESS [  4.468 s]
[INFO] Apache Juneau Marshall ............................. SUCCESS [ 41.163 s]
[INFO] Apache Juneau Marshal RDF .......................... SUCCESS [ 11.835 s]
[INFO] Apache Juneau Data Transfer Objects ................ SUCCESS [ 15.054 s]
[INFO] Apache Juneau Core ................................. SUCCESS [ 10.765 s]
[INFO] Apache Juneau Config File API ...................... SUCCESS [ 10.667 s]
[INFO] Apache Juneau Core Tests ........................... FAILURE [ 38.715 s]
[INFO] Apache Juneau - REST APIs .......................... SKIPPED
[INFO] Apache Juneau REST Servlet API ..................... SKIPPED
[INFO] Apache Juneau REST JAX/RS API ...................... SKIPPED
[INFO] Apache Juneau REST Servlet API, RDF support ........ SKIPPED
[INFO] Apache Juneau REST Spring Boot Integration ......... SKIPPED
[INFO] Apache Juneau REST Client API ...................... SKIPPED
[INFO] Apache Juneau - Microservice APIs .................. SKIPPED
[INFO] Apache Juneau Microservice Core Library ............ SKIPPED
[INFO] Apache Juneau Microservice Server .................. SKIPPED
[INFO] Apache Juneau Microservice Template ................ SKIPPED
[INFO] Apache Juneau - Examples ........................... SKIPPED
[INFO] Apache Juneau REST Examples ........................ SKIPPED
[INFO] Apache Juneau Microservice Tests ................... SKIPPED
[INFO] Apache Juneau Microservice Server - Spring Boot .... SKIPPED
[INFO] Apache Juneau Core Examples ........................ SKIPPED
[INFO] Apache Juneau REST Examples using Jetty ............ SKIPPED
[INFO] Apache Juneau REST Examples using Spring Boot ...... SKIPPED
[INFO] Apache Juneau Javadocs ............................. SKIPPED
[INFO] Apache Juneau - Release Engineering ................ SKIPPED
[INFO] Apache Juneau UberJar .............................. SKIPPED
[INFO] Apache Juneau Distribution ......................... SKIPPED
[INFO] ------------------------------------------------------------------------
[INFO] BUILD FAILURE
[INFO] ------------------------------------------------------------------------
[INFO] Total time: 02:23 min
[INFO] Finished at: 2018-12-07T15:16:44+00:00
[INFO] Final Memory: 100M/3665M
[INFO] ------------------------------------------------------------------------
[ERROR] Failed to execute goal org.apache.maven.plugins:maven-surefire-plugin:2.22.0:test
(default-test) on project juneau-core-test: There are test failures.
[ERROR] 
[ERROR] Please refer to <https://builds.apache.org/job/Juneau-Java-1.8/ws/juneau-core/juneau-core-test/target/surefire-reports>
for the individual test results.
[ERROR] Please refer to dump files (if any exist) [date]-jvmRun[N].dump, [date].dumpstream
and [date]-jvmRun[N].dumpstream.
[ERROR] -> [Help 1]
[ERROR] 
[ERROR] To see the full stack trace of the errors, re-run Maven with the -e switch.
[ERROR] Re-run Maven using the -X switch to enable full debug logging.
[ERROR] 
[ERROR] For more information about the errors and possible solutions, please read the following
articles:
[ERROR] [Help 1] http://cwiki.apache.org/confluence/display/MAVEN/MojoFailureException
[ERROR] 
[ERROR] After correcting the problems, you can resume the build with the command
[ERROR]   mvn <goals> -rf :juneau-core-test
Build step 'Invoke top-level Maven targets' marked build as failure
Recording test results
[FINDBUGS] Skipping publisher since build result is FAILURE
[TASKS] Skipping publisher since build result is FAILURE
Publishing Javadoc

Mime
View raw message