juneau-dev mailing list archives

Site index · List index
Message view « Date » · « Thread »
Top « Date » · « Thread »
From Apache Jenkins Server <jenk...@builds.apache.org>
Subject Build failed in Jenkins: Juneau-Java-1.8 #1164
Date Sat, 01 Dec 2018 22:05:24 GMT
See <https://builds.apache.org/job/Juneau-Java-1.8/1164/display/redirect?page=changes>

Changes:

[marcelosouzav] add sonar

[marcelosouzav] o created new project to split integration with SpringBoot

[marcelosouzav] I changed to add new annotation the integration with spring boot

[marcelosouzav] i added the dependency to new project

[marcelosouzav] i added new project

[marcelosouzav] i changed App.java

[marcelosouzav] i added .idea

[marcelosouzav] i added .idea

[marcelosouzav] i removed path .idea

[marcelosouzav] add ignire idea

[marcelosouzav] i changed the code

[marcelosouzav] i changed config to load servlets

[marcelosouzav] add config to log4j

[marcelosouzav] add ignired

[marcelosouzav] correct ignore

------------------------------------------
[...truncated 634.89 KB...]
Stopping server.
Server stopped.
[WARNING] Tests run: 2256, Failures: 0, Errors: 0, Skipped: 8, Time elapsed: 31.02 s - in
org.apache.juneau.rest.test._TestSuite
[INFO] 
[INFO] Results:
[INFO] 
[WARNING] Tests run: 2256, Failures: 0, Errors: 0, Skipped: 8
[INFO] 
[INFO] 
[INFO] --- maven-jar-plugin:3.1.0:jar (default-jar) @ juneau-microservice-test ---
[INFO] Building jar: <https://builds.apache.org/job/Juneau-Java-1.8/ws/juneau-microservice/juneau-microservice-test/target/juneau-microservice-test-8.0.0-SNAPSHOT.jar>
[INFO] 
[INFO] --- maven-site-plugin:3.7.1:attach-descriptor (attach-descriptor) @ juneau-microservice-test
---
[INFO] Skipping because packaging 'jar' is not pom.
[INFO] 
[INFO] --- apache-rat-plugin:0.12:check (default) @ juneau-microservice-test ---
[INFO] Enabled default license matchers.
[INFO] Will parse SCM ignores for exclusions...
[INFO] Parsing exclusions from <https://builds.apache.org/job/Juneau-Java-1.8/ws/juneau-microservice/juneau-microservice-test/.gitignore>
[INFO] Finished adding exclusions from SCM ignore files.
[INFO] 62 implicit excludes (use -debug for more details).
[INFO] Exclude: **/DEPENDENCIES
[INFO] Exclude: **/target/**
[INFO] Exclude: **/.settings/**
[INFO] Exclude: **/.project
[INFO] Exclude: **/.classpath
[INFO] Exclude: **/*.launch
[INFO] Exclude: **/jetty.out.xml
[INFO] Exclude: **/derby.log
[INFO] Exclude: **/dependency-reduced-pom.xml
[INFO] Exclude: **/docs.txt
[INFO] Exclude: **/toc.txt
[INFO] Exclude: **/app.json
[INFO] Exclude: **/Procfile
[INFO] 24 resources included (use -debug for more details)
[INFO] Rat check: Summary over all files. Unapproved: 0, unknown: 0, generated: 0, approved:
24 licenses.
[INFO] 
[INFO] --- maven-install-plugin:2.5.2:install (default-install) @ juneau-microservice-test
---
[INFO] Installing <https://builds.apache.org/job/Juneau-Java-1.8/ws/juneau-microservice/juneau-microservice-test/target/juneau-microservice-test-8.0.0-SNAPSHOT.jar>
to /home/jenkins/.m2/repository/org/apache/juneau/juneau-microservice-test/8.0.0-SNAPSHOT/juneau-microservice-test-8.0.0-SNAPSHOT.jar
[INFO] Installing <https://builds.apache.org/job/Juneau-Java-1.8/ws/juneau-microservice/juneau-microservice-test/pom.xml>
to /home/jenkins/.m2/repository/org/apache/juneau/juneau-microservice-test/8.0.0-SNAPSHOT/juneau-microservice-test-8.0.0-SNAPSHOT.pom
[INFO] 
[INFO] --- maven-enforcer-plugin:1.4.1:enforce (enforce-maven-version) @ juneau-microservice-test
---
[INFO] 
[INFO] --- maven-enforcer-plugin:1.4.1:enforce (enforce-maven) @ juneau-microservice-test
---
[INFO] 
[INFO] --- maven-remote-resources-plugin:1.5:process (process-resource-bundles) @ juneau-microservice-test
---
[INFO] 
[INFO] --- maven-resources-plugin:3.1.0:resources (default-resources) @ juneau-microservice-test
---
[INFO] Using 'UTF-8' encoding to copy filtered resources.
[INFO] Copying 3 resources
[INFO] Copying 3 resources
[INFO] Copying 3 resources
[INFO] 
[INFO] --- maven-compiler-plugin:3.7.0:compile (default-compile) @ juneau-microservice-test
---
[INFO] Nothing to compile - all classes are up to date
[INFO] 
[INFO] --- maven-resources-plugin:3.1.0:testResources (default-testResources) @ juneau-microservice-test
---
[INFO] Using 'UTF-8' encoding to copy filtered resources.
[INFO] skip non existing resourceDirectory <https://builds.apache.org/job/Juneau-Java-1.8/ws/juneau-microservice/juneau-microservice-test/src/test/resources>
[INFO] Copying 3 resources
[INFO] Copying 3 resources
[INFO] 
[INFO] --- maven-compiler-plugin:3.7.0:testCompile (default-testCompile) @ juneau-microservice-test
---
[INFO] Nothing to compile - all classes are up to date
[INFO] 
[INFO] --- maven-surefire-plugin:2.22.0:test (default-test) @ juneau-microservice-test ---
[INFO] Skipping execution of surefire because it has already been run for this configuration
[INFO] 
[INFO] --- maven-jar-plugin:3.1.0:jar (default-jar) @ juneau-microservice-test ---
[INFO] 
[INFO] --- maven-site-plugin:3.7.1:attach-descriptor (attach-descriptor) @ juneau-microservice-test
---
[INFO] Skipping because packaging 'jar' is not pom.
[INFO] 
[INFO] --- apache-rat-plugin:0.12:check (default) @ juneau-microservice-test ---
[INFO] Enabled default license matchers.
[INFO] Will parse SCM ignores for exclusions...
[INFO] Parsing exclusions from <https://builds.apache.org/job/Juneau-Java-1.8/ws/juneau-microservice/juneau-microservice-test/.gitignore>
[INFO] Finished adding exclusions from SCM ignore files.
[INFO] 62 implicit excludes (use -debug for more details).
[INFO] Exclude: **/DEPENDENCIES
[INFO] Exclude: **/target/**
[INFO] Exclude: **/.settings/**
[INFO] Exclude: **/.project
[INFO] Exclude: **/.classpath
[INFO] Exclude: **/*.launch
[INFO] Exclude: **/jetty.out.xml
[INFO] Exclude: **/derby.log
[INFO] Exclude: **/dependency-reduced-pom.xml
[INFO] Exclude: **/docs.txt
[INFO] Exclude: **/toc.txt
[INFO] Exclude: **/app.json
[INFO] Exclude: **/Procfile
[INFO] 24 resources included (use -debug for more details)
[INFO] Rat check: Summary over all files. Unapproved: 0, unknown: 0, generated: 0, approved:
24 licenses.
[INFO] 
[INFO] --- maven-install-plugin:2.5.2:install (default-install) @ juneau-microservice-test
---
[INFO] Installing <https://builds.apache.org/job/Juneau-Java-1.8/ws/juneau-microservice/juneau-microservice-test/target/juneau-microservice-test-8.0.0-SNAPSHOT.jar>
to /home/jenkins/.m2/repository/org/apache/juneau/juneau-microservice-test/8.0.0-SNAPSHOT/juneau-microservice-test-8.0.0-SNAPSHOT.jar
[INFO] Installing <https://builds.apache.org/job/Juneau-Java-1.8/ws/juneau-microservice/juneau-microservice-test/pom.xml>
to /home/jenkins/.m2/repository/org/apache/juneau/juneau-microservice-test/8.0.0-SNAPSHOT/juneau-microservice-test-8.0.0-SNAPSHOT.pom
[INFO] 
[INFO] --- maven-deploy-plugin:2.8.2:deploy (default-deploy) @ juneau-microservice-test ---
Downloading: https://repository.apache.org/content/repositories/snapshots/org/apache/juneau/juneau-microservice-test/8.0.0-SNAPSHOT/maven-metadata.xml
794/794 B               Downloaded: https://repository.apache.org/content/repositories/snapshots/org/apache/juneau/juneau-microservice-test/8.0.0-SNAPSHOT/maven-metadata.xml
(794 B at 1.2 KB/sec)
Uploading: https://repository.apache.org/content/repositories/snapshots/org/apache/juneau/juneau-microservice-test/8.0.0-SNAPSHOT/juneau-microservice-test-8.0.0-20181201.220507-46.jar
2/29 KB     4/29 KB   6/29 KB   8/29 KB   10/29 KB   12/29 KB   14/29 KB   16/29 KB   18/29
KB   20/29 KB   22/29 KB   24/29 KB   26/29 KB   28/29 KB   29/29 KB              Uploaded:
https://repository.apache.org/content/repositories/snapshots/org/apache/juneau/juneau-microservice-test/8.0.0-SNAPSHOT/juneau-microservice-test-8.0.0-20181201.220507-46.jar
(29 KB at 29.0 KB/sec)
Uploading: https://repository.apache.org/content/repositories/snapshots/org/apache/juneau/juneau-microservice-test/8.0.0-SNAPSHOT/juneau-microservice-test-8.0.0-20181201.220507-46.pom
2/4 KB     4/4 KB            Uploaded: https://repository.apache.org/content/repositories/snapshots/org/apache/juneau/juneau-microservice-test/8.0.0-SNAPSHOT/juneau-microservice-test-8.0.0-20181201.220507-46.pom
(4 KB at 4.1 KB/sec)
Downloading: https://repository.apache.org/content/repositories/snapshots/org/apache/juneau/juneau-microservice-test/maven-metadata.xml
543/543 B               Downloaded: https://repository.apache.org/content/repositories/snapshots/org/apache/juneau/juneau-microservice-test/maven-metadata.xml
(543 B at 0.9 KB/sec)
Uploading: https://repository.apache.org/content/repositories/snapshots/org/apache/juneau/juneau-microservice-test/8.0.0-SNAPSHOT/maven-metadata.xml
794/794 B               Uploaded: https://repository.apache.org/content/repositories/snapshots/org/apache/juneau/juneau-microservice-test/8.0.0-SNAPSHOT/maven-metadata.xml
(794 B at 0.8 KB/sec)
Uploading: https://repository.apache.org/content/repositories/snapshots/org/apache/juneau/juneau-microservice-test/maven-metadata.xml
543/543 B               Uploaded: https://repository.apache.org/content/repositories/snapshots/org/apache/juneau/juneau-microservice-test/maven-metadata.xml
(543 B at 0.6 KB/sec)
[INFO]                                                                         
[INFO] ------------------------------------------------------------------------
[INFO] Building Apache Juneau Microservice Server - Spring Boot 8.0.0-SNAPSHOT
[INFO] ------------------------------------------------------------------------
Downloading: https://repo.maven.apache.org/maven2/org/springframework/boot/spring-boot-maven-plugin/maven-metadata.xml
3/4 KB      4/4 KB            Downloaded: https://repo.maven.apache.org/maven2/org/springframework/boot/spring-boot-maven-plugin/maven-metadata.xml
(4 KB at 35.9 KB/sec)
Downloading: https://repo.maven.apache.org/maven2/org/springframework/boot/spring-boot-maven-plugin/2.1.1.RELEASE/spring-boot-maven-plugin-2.1.1.RELEASE.pom
3/5 KB   5/5 KB            Downloaded: https://repo.maven.apache.org/maven2/org/springframework/boot/spring-boot-maven-plugin/2.1.1.RELEASE/spring-boot-maven-plugin-2.1.1.RELEASE.pom
(5 KB at 273.4 KB/sec)
Downloading: https://repo.maven.apache.org/maven2/org/springframework/boot/spring-boot-tools/2.1.1.RELEASE/spring-boot-tools-2.1.1.RELEASE.pom
2/2 KB            Downloaded: https://repo.maven.apache.org/maven2/org/springframework/boot/spring-boot-tools/2.1.1.RELEASE/spring-boot-tools-2.1.1.RELEASE.pom
(2 KB at 110.8 KB/sec)
Downloading: https://repo.maven.apache.org/maven2/org/springframework/boot/spring-boot-parent/2.1.1.RELEASE/spring-boot-parent-2.1.1.RELEASE.pom
2/2 KB            Downloaded: https://repo.maven.apache.org/maven2/org/springframework/boot/spring-boot-parent/2.1.1.RELEASE/spring-boot-parent-2.1.1.RELEASE.pom
(2 KB at 85.9 KB/sec)
Downloading: https://repo.maven.apache.org/maven2/org/springframework/boot/spring-boot-dependencies/2.1.1.RELEASE/spring-boot-dependencies-2.1.1.RELEASE.pom
3/139 KB   5/139 KB   8/139 KB   11/139 KB   13/139 KB   16/139 KB   19/139 KB   21/139 KB
  24/139 KB   27/139 KB   29/139 KB   32/139 KB   36/139 KB   40/139 KB   44/139 KB   48/139
KB   52/139 KB   56/139 KB   60/139 KB   64/139 KB   68/139 KB   72/139 KB   76/139 KB   80/139
KB   84/139 KB   88/139 KB   92/139 KB   96/139 KB   100/139 KB   104/139 KB   108/139 KB
  112/139 KB   116/139 KB   120/139 KB   124/139 KB   128/139 KB   132/139 KB   136/139 KB
  139/139 KB                Downloaded: https://repo.maven.apache.org/maven2/org/springframework/boot/spring-boot-dependencies/2.1.1.RELEASE/spring-boot-dependencies-2.1.1.RELEASE.pom
(139 KB at 4064.9 KB/sec)
Downloading: https://repo.maven.apache.org/maven2/io/netty/netty-bom/4.1.31.Final/netty-bom-4.1.31.Final.pom
4/8 KB       8/8 KB   8/8 KB            Downloaded: https://repo.maven.apache.org/maven2/io/netty/netty-bom/4.1.31.Final/netty-bom-4.1.31.Final.pom
(8 KB at 454.4 KB/sec)
Downloading: https://repo.maven.apache.org/maven2/io/projectreactor/reactor-bom/Californium-SR3/reactor-bom-Californium-SR3.pom
4/4 KB            Downloaded: https://repo.maven.apache.org/maven2/io/projectreactor/reactor-bom/Californium-SR3/reactor-bom-Californium-SR3.pom
(4 KB at 221.7 KB/sec)
Downloading: https://repo.maven.apache.org/maven2/org/apache/logging/log4j/log4j-bom/2.11.1/log4j-bom-2.11.1.pom
         Downloaded: https://repo.maven.apache.org/maven2/org/apache/logging/log4j/log4j-bom/2.11.1/log4j-bom-2.11.1.pom
(0 B at 0.0 KB/sec)
Downloading: https://repo.maven.apache.org/maven2/org/eclipse/jetty/jetty-bom/9.4.12.v20180830/jetty-bom-9.4.12.v20180830.pom
         Downloaded: https://repo.maven.apache.org/maven2/org/eclipse/jetty/jetty-bom/9.4.12.v20180830/jetty-bom-9.4.12.v20180830.pom
(0 B at 0.0 KB/sec)
Downloading: https://repo.maven.apache.org/maven2/org/glassfish/jersey/jersey-bom/2.27/jersey-bom-2.27.pom
         Downloaded: https://repo.maven.apache.org/maven2/org/glassfish/jersey/jersey-bom/2.27/jersey-bom-2.27.pom
(0 B at 0.0 KB/sec)
Downloading: https://repo.maven.apache.org/maven2/org/junit/junit-bom/5.3.2/junit-bom-5.3.2.pom
3/4 KB   4/4 KB            Downloaded: https://repo.maven.apache.org/maven2/org/junit/junit-bom/5.3.2/junit-bom-5.3.2.pom
(4 KB at 249.2 KB/sec)
Downloading: https://repo.maven.apache.org/maven2/org/springframework/spring-framework-bom/5.1.3.RELEASE/spring-framework-bom-5.1.3.RELEASE.pom
3/6 KB   5/6 KB   6/6 KB            Downloaded: https://repo.maven.apache.org/maven2/org/springframework/spring-framework-bom/5.1.3.RELEASE/spring-framework-bom-5.1.3.RELEASE.pom
(6 KB at 321.3 KB/sec)
Downloading: https://repo.maven.apache.org/maven2/org/springframework/data/spring-data-releasetrain/Lovelace-SR3/spring-data-releasetrain-Lovelace-SR3.pom
3/5 KB   5/5 KB            Downloaded: https://repo.maven.apache.org/maven2/org/springframework/data/spring-data-releasetrain/Lovelace-SR3/spring-data-releasetrain-Lovelace-SR3.pom
(5 KB at 302.5 KB/sec)
Downloading: https://repo.maven.apache.org/maven2/org/springframework/data/build/spring-data-build/2.1.3.RELEASE/spring-data-build-2.1.3.RELEASE.pom
3/7 KB   5/7 KB   7/7 KB            Downloaded: https://repo.maven.apache.org/maven2/org/springframework/data/build/spring-data-build/2.1.3.RELEASE/spring-data-build-2.1.3.RELEASE.pom
(7 KB at 376.4 KB/sec)
Downloading: https://repo.maven.apache.org/maven2/org/springframework/integration/spring-integration-bom/5.1.1.RELEASE/spring-integration-bom-5.1.1.RELEASE.pom
3/9 KB   5/9 KB   8/9 KB   9/9 KB            Downloaded: https://repo.maven.apache.org/maven2/org/springframework/integration/spring-integration-bom/5.1.1.RELEASE/spring-integration-bom-5.1.1.RELEASE.pom
(9 KB at 470.4 KB/sec)
Downloading: https://repo.maven.apache.org/maven2/org/springframework/security/spring-security-bom/5.1.2.RELEASE/spring-security-bom-5.1.2.RELEASE.pom
3/5 KB   5/5 KB   5/5 KB            Downloaded: https://repo.maven.apache.org/maven2/org/springframework/security/spring-security-bom/5.1.2.RELEASE/spring-security-bom-5.1.2.RELEASE.pom
(5 KB at 306.6 KB/sec)
Downloading: https://repo.maven.apache.org/maven2/org/springframework/session/spring-session-bom/Bean-SR1/spring-session-bom-Bean-SR1.pom
3/3 KB   3/3 KB            Downloaded: https://repo.maven.apache.org/maven2/org/springframework/session/spring-session-bom/Bean-SR1/spring-session-bom-Bean-SR1.pom
(3 KB at 181.2 KB/sec)
Downloading: https://repo.maven.apache.org/maven2/org/springframework/boot/spring-boot-maven-plugin/2.1.1.RELEASE/spring-boot-maven-plugin-2.1.1.RELEASE.jar
3/67 KB   5/67 KB   8/67 KB   11/67 KB   13/67 KB   16/67 KB   19/67 KB   21/67 KB   24/67
KB   27/67 KB   29/67 KB   32/67 KB   36/67 KB   40/67 KB   44/67 KB   48/67 KB   52/67 KB
  56/67 KB   60/67 KB   64/67 KB   67/67 KB              Downloaded: https://repo.maven.apache.org/maven2/org/springframework/boot/spring-boot-maven-plugin/2.1.1.RELEASE/spring-boot-maven-plugin-2.1.1.RELEASE.jar
(67 KB at 2671.6 KB/sec)
[INFO] 
[INFO] --- maven-clean-plugin:3.1.0:clean (default-clean) @ juneau-microservice-server-springboot
---
[INFO] 
[INFO] --- maven-enforcer-plugin:1.4.1:enforce (enforce-maven-version) @ juneau-microservice-server-springboot
---
[INFO] 
[INFO] --- maven-enforcer-plugin:1.4.1:enforce (enforce-maven) @ juneau-microservice-server-springboot
---
[INFO] 
[INFO] --- maven-remote-resources-plugin:1.5:process (process-resource-bundles) @ juneau-microservice-server-springboot
---
[INFO] 
[INFO] --- maven-resources-plugin:3.1.0:resources (default-resources) @ juneau-microservice-server-springboot
---
[INFO] Using 'UTF-8' encoding to copy filtered resources.
[INFO] skip non existing resourceDirectory <https://builds.apache.org/job/Juneau-Java-1.8/ws/juneau-microservice/juneau-microservice-server-springboot/src/main/resources>
[INFO] Copying 3 resources
[INFO] 
[INFO] --- maven-compiler-plugin:3.7.0:compile (default-compile) @ juneau-microservice-server-springboot
---
[INFO] Changes detected - recompiling the module!
[INFO] Compiling 3 source files to <https://builds.apache.org/job/Juneau-Java-1.8/ws/juneau-microservice/juneau-microservice-server-springboot/target/classes>
[INFO] <https://builds.apache.org/job/Juneau-Java-1.8/ws/juneau-microservice/juneau-microservice-server-springboot/src/main/java/org/apache/juneau/microservice/springboot/config/ServletConfiguration.java>:
Some input files use unchecked or unsafe operations.
[INFO] <https://builds.apache.org/job/Juneau-Java-1.8/ws/juneau-microservice/juneau-microservice-server-springboot/src/main/java/org/apache/juneau/microservice/springboot/config/ServletConfiguration.java>:
Recompile with -Xlint:unchecked for details.
[INFO] -------------------------------------------------------------
[ERROR] COMPILATION ERROR : 
[INFO] -------------------------------------------------------------
[ERROR] <https://builds.apache.org/job/Juneau-Java-1.8/ws/juneau-microservice/juneau-microservice-server-springboot/src/main/java/org/apache/juneau/microservice/springboot/annotations/EnabledJuneauIntegration.java>:[16,56]
cannot find symbol
  symbol:   class AppConfiguration
  location: package org.apache.juneau.microservice.springboot.config
[ERROR] <https://builds.apache.org/job/Juneau-Java-1.8/ws/juneau-microservice/juneau-microservice-server-springboot/src/main/java/org/apache/juneau/microservice/springboot/annotations/EnabledJuneauIntegration.java>:[27,36]
cannot find symbol
  symbol: class AppConfiguration
[ERROR] <https://builds.apache.org/job/Juneau-Java-1.8/ws/juneau-microservice/juneau-microservice-server-springboot/src/main/java/org/apache/juneau/microservice/springboot/config/ServletConfiguration.java>:[42,52]
for-each not applicable to expression type
  required: array or java.lang.Iterable
  found:    java.lang.Class<capture#1 of ? extends org.apache.juneau.microservice.BasicRestServletJenaGroup>
[INFO] 3 errors 
[INFO] -------------------------------------------------------------
[INFO]                                                                         
[INFO] ------------------------------------------------------------------------
[INFO] Skipping Apache Juneau
[INFO] This project has been banned from the build due to previous failures.
[INFO] ------------------------------------------------------------------------
[INFO] ------------------------------------------------------------------------
[INFO] Reactor Summary:
[INFO] 
[INFO] Apache Juneau ...................................... SUCCESS [  8.205 s]
[INFO] Apache Juneau - Core APIs .......................... SUCCESS [  4.379 s]
[INFO] Apache Juneau Marshall ............................. SUCCESS [ 40.165 s]
[INFO] Apache Juneau Marshal RDF .......................... SUCCESS [ 11.431 s]
[INFO] Apache Juneau Data Transfer Objects ................ SUCCESS [ 14.553 s]
[INFO] Apache Juneau Core ................................. SUCCESS [ 10.832 s]
[INFO] Apache Juneau Config File API ...................... SUCCESS [ 10.406 s]
[INFO] Apache Juneau Core Tests ........................... SUCCESS [ 52.562 s]
[INFO] Apache Juneau - REST APIs .......................... SUCCESS [  4.240 s]
[INFO] Apache Juneau REST Servlet API ..................... SUCCESS [ 30.051 s]
[INFO] Apache Juneau REST JAX/RS API ...................... SUCCESS [ 10.139 s]
[INFO] Apache Juneau REST Client API ...................... SUCCESS [ 16.134 s]
[INFO] Apache Juneau - Microservice APIs .................. SUCCESS [  4.128 s]
[INFO] Apache Juneau Microservice Server .................. SUCCESS [ 11.196 s]
[INFO] Apache Juneau Microservice Template ................ SUCCESS [ 10.743 s]
[INFO] Apache Juneau - Examples ........................... SUCCESS [  4.135 s]
[INFO] Apache Juneau REST Examples ........................ SUCCESS [01:14 min]
[INFO] Apache Juneau Microservice Tests ................... SUCCESS [ 38.707 s]
[INFO] Apache Juneau Microservice Server - Spring Boot .... FAILURE [  3.441 s]
[INFO] Apache Juneau Core Examples ........................ SKIPPED
[INFO] Apache Juneau REST Examples using Spring Boot ...... SKIPPED
[INFO] Apache Juneau Javadocs ............................. SKIPPED
[INFO] Apache Juneau - Release Engineering ................ SKIPPED
[INFO] Apache Juneau UberJar .............................. SKIPPED
[INFO] Apache Juneau Distribution ......................... SKIPPED
[INFO] ------------------------------------------------------------------------
[INFO] BUILD FAILURE
[INFO] ------------------------------------------------------------------------
[INFO] Total time: 06:01 min
[INFO] Finished at: 2018-12-01T22:05:15+00:00
[INFO] Final Memory: 126M/4080M
[INFO] ------------------------------------------------------------------------
[ERROR] Failed to execute goal org.apache.maven.plugins:maven-compiler-plugin:3.7.0:compile
(default-compile) on project juneau-microservice-server-springboot: Compilation failure: Compilation
failure:
[ERROR] <https://builds.apache.org/job/Juneau-Java-1.8/ws/juneau-microservice/juneau-microservice-server-springboot/src/main/java/org/apache/juneau/microservice/springboot/annotations/EnabledJuneauIntegration.java>:[16,56]
cannot find symbol
[ERROR] symbol:   class AppConfiguration
[ERROR] location: package org.apache.juneau.microservice.springboot.config
[ERROR] <https://builds.apache.org/job/Juneau-Java-1.8/ws/juneau-microservice/juneau-microservice-server-springboot/src/main/java/org/apache/juneau/microservice/springboot/annotations/EnabledJuneauIntegration.java>:[27,36]
cannot find symbol
[ERROR] symbol: class AppConfiguration
[ERROR] <https://builds.apache.org/job/Juneau-Java-1.8/ws/juneau-microservice/juneau-microservice-server-springboot/src/main/java/org/apache/juneau/microservice/springboot/config/ServletConfiguration.java>:[42,52]
for-each not applicable to expression type
[ERROR] required: array or java.lang.Iterable
[ERROR] found:    java.lang.Class<capture#1 of ? extends org.apache.juneau.microservice.BasicRestServletJenaGroup>
[ERROR] -> [Help 1]
[ERROR] 
[ERROR] To see the full stack trace of the errors, re-run Maven with the -e switch.
[ERROR] Re-run Maven using the -X switch to enable full debug logging.
[ERROR] 
[ERROR] For more information about the errors and possible solutions, please read the following
articles:
[ERROR] [Help 1] http://cwiki.apache.org/confluence/display/MAVEN/MojoFailureException
[ERROR] 
[ERROR] After correcting the problems, you can resume the build with the command
[ERROR]   mvn <goals> -rf :juneau-microservice-server-springboot
Build step 'Invoke top-level Maven targets' marked build as failure
Recording test results
[FINDBUGS] Skipping publisher since build result is FAILURE
[TASKS] Skipping publisher since build result is FAILURE
Publishing Javadoc
Not sending mail to unregistered user marcelosouzav@gmail.com

Mime
View raw message