juneau-dev mailing list archives

Site index · List index
Message view « Date » · « Thread »
Top « Date » · « Thread »
From Apache Jenkins Server <jenk...@builds.apache.org>
Subject Build failed in Jenkins: Juneau-Java-1.8 #1176
Date Sat, 08 Dec 2018 20:19:55 GMT
See <https://builds.apache.org/job/Juneau-Java-1.8/1176/display/redirect?page=changes>

Changes:

[kaperera] adding Json complex example

[kaperera] adding xml simple example to core samples

[kaperera] adding rdf complex example

[JamesBognar] Javadocs.

------------------------------------------
[...truncated 494.65 KB...]
[INFO] 
[INFO] --- maven-site-plugin:3.7.1:attach-descriptor (attach-descriptor) @ juneau-microservice-test
---
[INFO] Skipping because packaging 'jar' is not pom.
[INFO] 
[INFO] --- apache-rat-plugin:0.12:check (default) @ juneau-microservice-test ---
[INFO] Enabled default license matchers.
[INFO] Will parse SCM ignores for exclusions...
[INFO] Parsing exclusions from <https://builds.apache.org/job/Juneau-Java-1.8/ws/juneau-microservice/juneau-microservice-test/.gitignore>
[INFO] Finished adding exclusions from SCM ignore files.
[INFO] 62 implicit excludes (use -debug for more details).
[INFO] Exclude: **/DEPENDENCIES
[INFO] Exclude: **/target/**
[INFO] Exclude: **/.settings/**
[INFO] Exclude: **/.project
[INFO] Exclude: **/.classpath
[INFO] Exclude: **/*.launch
[INFO] Exclude: **/jetty.out.xml
[INFO] Exclude: **/derby.log
[INFO] Exclude: **/dependency-reduced-pom.xml
[INFO] Exclude: **/docs.txt
[INFO] Exclude: **/toc.txt
[INFO] Exclude: **/app.json
[INFO] Exclude: **/Procfile
[INFO] 24 resources included (use -debug for more details)
[INFO] Rat check: Summary over all files. Unapproved: 0, unknown: 0, generated: 0, approved:
24 licenses.
[INFO] 
[INFO] --- maven-install-plugin:2.5.2:install (default-install) @ juneau-microservice-test
---
[INFO] Installing <https://builds.apache.org/job/Juneau-Java-1.8/ws/juneau-microservice/juneau-microservice-test/target/juneau-microservice-test-8.0.0-SNAPSHOT.jar>
to /home/jenkins/.m2/repository/org/apache/juneau/juneau-microservice-test/8.0.0-SNAPSHOT/juneau-microservice-test-8.0.0-SNAPSHOT.jar
[INFO] Installing <https://builds.apache.org/job/Juneau-Java-1.8/ws/juneau-microservice/juneau-microservice-test/pom.xml>
to /home/jenkins/.m2/repository/org/apache/juneau/juneau-microservice-test/8.0.0-SNAPSHOT/juneau-microservice-test-8.0.0-SNAPSHOT.pom
[INFO] 
[INFO] --- maven-enforcer-plugin:1.4.1:enforce (enforce-maven-version) @ juneau-microservice-test
---
[INFO] 
[INFO] --- maven-enforcer-plugin:1.4.1:enforce (enforce-maven) @ juneau-microservice-test
---
[INFO] 
[INFO] --- maven-remote-resources-plugin:1.5:process (process-resource-bundles) @ juneau-microservice-test
---
[INFO] 
[INFO] --- maven-resources-plugin:3.1.0:resources (default-resources) @ juneau-microservice-test
---
[INFO] Using 'UTF-8' encoding to copy filtered resources.
[INFO] Copying 3 resources
[INFO] Copying 3 resources
[INFO] Copying 3 resources
[INFO] 
[INFO] --- maven-compiler-plugin:3.7.0:compile (default-compile) @ juneau-microservice-test
---
[INFO] Nothing to compile - all classes are up to date
[INFO] 
[INFO] --- maven-resources-plugin:3.1.0:testResources (default-testResources) @ juneau-microservice-test
---
[INFO] Using 'UTF-8' encoding to copy filtered resources.
[INFO] skip non existing resourceDirectory <https://builds.apache.org/job/Juneau-Java-1.8/ws/juneau-microservice/juneau-microservice-test/src/test/resources>
[INFO] Copying 3 resources
[INFO] Copying 3 resources
[INFO] 
[INFO] --- maven-compiler-plugin:3.7.0:testCompile (default-testCompile) @ juneau-microservice-test
---
[INFO] Nothing to compile - all classes are up to date
[INFO] 
[INFO] --- maven-surefire-plugin:2.22.0:test (default-test) @ juneau-microservice-test ---
[INFO] Skipping execution of surefire because it has already been run for this configuration
[INFO] 
[INFO] --- maven-jar-plugin:3.1.0:jar (default-jar) @ juneau-microservice-test ---
[INFO] Building jar: <https://builds.apache.org/job/Juneau-Java-1.8/ws/juneau-microservice/juneau-microservice-test/target/juneau-microservice-test-8.0.0-SNAPSHOT.jar>
[INFO] 
[INFO] --- maven-site-plugin:3.7.1:attach-descriptor (attach-descriptor) @ juneau-microservice-test
---
[INFO] Skipping because packaging 'jar' is not pom.
[INFO] 
[INFO] --- apache-rat-plugin:0.12:check (default) @ juneau-microservice-test ---
[INFO] Enabled default license matchers.
[INFO] Will parse SCM ignores for exclusions...
[INFO] Parsing exclusions from <https://builds.apache.org/job/Juneau-Java-1.8/ws/juneau-microservice/juneau-microservice-test/.gitignore>
[INFO] Finished adding exclusions from SCM ignore files.
[INFO] 62 implicit excludes (use -debug for more details).
[INFO] Exclude: **/DEPENDENCIES
[INFO] Exclude: **/target/**
[INFO] Exclude: **/.settings/**
[INFO] Exclude: **/.project
[INFO] Exclude: **/.classpath
[INFO] Exclude: **/*.launch
[INFO] Exclude: **/jetty.out.xml
[INFO] Exclude: **/derby.log
[INFO] Exclude: **/dependency-reduced-pom.xml
[INFO] Exclude: **/docs.txt
[INFO] Exclude: **/toc.txt
[INFO] Exclude: **/app.json
[INFO] Exclude: **/Procfile
[INFO] 24 resources included (use -debug for more details)
[INFO] Rat check: Summary over all files. Unapproved: 0, unknown: 0, generated: 0, approved:
24 licenses.
[INFO] 
[INFO] --- maven-install-plugin:2.5.2:install (default-install) @ juneau-microservice-test
---
[INFO] Installing <https://builds.apache.org/job/Juneau-Java-1.8/ws/juneau-microservice/juneau-microservice-test/target/juneau-microservice-test-8.0.0-SNAPSHOT.jar>
to /home/jenkins/.m2/repository/org/apache/juneau/juneau-microservice-test/8.0.0-SNAPSHOT/juneau-microservice-test-8.0.0-SNAPSHOT.jar
[INFO] Installing <https://builds.apache.org/job/Juneau-Java-1.8/ws/juneau-microservice/juneau-microservice-test/pom.xml>
to /home/jenkins/.m2/repository/org/apache/juneau/juneau-microservice-test/8.0.0-SNAPSHOT/juneau-microservice-test-8.0.0-SNAPSHOT.pom
[INFO] 
[INFO] --- maven-deploy-plugin:2.8.2:deploy (default-deploy) @ juneau-microservice-test ---
Downloading: https://repository.apache.org/content/repositories/snapshots/org/apache/juneau/juneau-microservice-test/8.0.0-SNAPSHOT/maven-metadata.xml
794/794 B                 Downloaded: https://repository.apache.org/content/repositories/snapshots/org/apache/juneau/juneau-microservice-test/8.0.0-SNAPSHOT/maven-metadata.xml
(794 B at 1.1 KB/sec)
Uploading: https://repository.apache.org/content/repositories/snapshots/org/apache/juneau/juneau-microservice-test/8.0.0-SNAPSHOT/juneau-microservice-test-8.0.0-20181208.201942-56.jar
2/29 KB     4/29 KB   6/29 KB   8/29 KB   10/29 KB   12/29 KB   14/29 KB   16/29 KB   18/29
KB   20/29 KB   22/29 KB   24/29 KB   26/29 KB   28/29 KB   29/29 KB              Uploaded:
https://repository.apache.org/content/repositories/snapshots/org/apache/juneau/juneau-microservice-test/8.0.0-SNAPSHOT/juneau-microservice-test-8.0.0-20181208.201942-56.jar
(29 KB at 28.9 KB/sec)
Uploading: https://repository.apache.org/content/repositories/snapshots/org/apache/juneau/juneau-microservice-test/8.0.0-SNAPSHOT/juneau-microservice-test-8.0.0-20181208.201942-56.pom
2/4 KB     4/4 KB            Uploaded: https://repository.apache.org/content/repositories/snapshots/org/apache/juneau/juneau-microservice-test/8.0.0-SNAPSHOT/juneau-microservice-test-8.0.0-20181208.201942-56.pom
(4 KB at 4.2 KB/sec)
Downloading: https://repository.apache.org/content/repositories/snapshots/org/apache/juneau/juneau-microservice-test/maven-metadata.xml
543/543 B               Downloaded: https://repository.apache.org/content/repositories/snapshots/org/apache/juneau/juneau-microservice-test/maven-metadata.xml
(543 B at 0.9 KB/sec)
Uploading: https://repository.apache.org/content/repositories/snapshots/org/apache/juneau/juneau-microservice-test/8.0.0-SNAPSHOT/maven-metadata.xml
794/794 B               Uploaded: https://repository.apache.org/content/repositories/snapshots/org/apache/juneau/juneau-microservice-test/8.0.0-SNAPSHOT/maven-metadata.xml
(794 B at 0.9 KB/sec)
Uploading: https://repository.apache.org/content/repositories/snapshots/org/apache/juneau/juneau-microservice-test/maven-metadata.xml
543/543 B               Uploaded: https://repository.apache.org/content/repositories/snapshots/org/apache/juneau/juneau-microservice-test/maven-metadata.xml
(543 B at 0.6 KB/sec)
[INFO]                                                                         
[INFO] ------------------------------------------------------------------------
[INFO] Building Apache Juneau Core Examples 8.0.0-SNAPSHOT
[INFO] ------------------------------------------------------------------------
[INFO] 
[INFO] --- maven-clean-plugin:3.1.0:clean (default-clean) @ juneau-examples-core ---
[INFO] Deleting <https://builds.apache.org/job/Juneau-Java-1.8/ws/juneau-examples/juneau-examples-core/target>
[INFO] 
[INFO] --- maven-enforcer-plugin:1.4.1:enforce (enforce-maven-version) @ juneau-examples-core
---
[INFO] 
[INFO] --- maven-enforcer-plugin:1.4.1:enforce (enforce-maven) @ juneau-examples-core ---
[INFO] 
[INFO] --- maven-remote-resources-plugin:1.5:process (process-resource-bundles) @ juneau-examples-core
---
[INFO] 
[INFO] --- maven-resources-plugin:3.1.0:resources (default-resources) @ juneau-examples-core
---
[INFO] Using 'UTF-8' encoding to copy filtered resources.
[INFO] Copying 1 resource
[INFO] Copying 3 resources
[INFO] 
[INFO] --- maven-compiler-plugin:3.7.0:compile (default-compile) @ juneau-examples-core ---
[INFO] Changes detected - recompiling the module!
[INFO] Compiling 10 source files to <https://builds.apache.org/job/Juneau-Java-1.8/ws/juneau-examples/juneau-examples-core/target/classes>
[INFO] 
[INFO] --- maven-resources-plugin:3.1.0:testResources (default-testResources) @ juneau-examples-core
---
[INFO] Using 'UTF-8' encoding to copy filtered resources.
[INFO] skip non existing resourceDirectory <https://builds.apache.org/job/Juneau-Java-1.8/ws/juneau-examples/juneau-examples-core/src/test/resources>
[INFO] Copying 3 resources
[INFO] 
[INFO] --- maven-compiler-plugin:3.7.0:testCompile (default-testCompile) @ juneau-examples-core
---
[INFO] Nothing to compile - all classes are up to date
[INFO] 
[INFO] --- maven-surefire-plugin:2.22.0:test (default-test) @ juneau-examples-core ---
[INFO] 
[INFO] --- maven-jar-plugin:3.1.0:jar (default-jar) @ juneau-examples-core ---
[INFO] Building jar: <https://builds.apache.org/job/Juneau-Java-1.8/ws/juneau-examples/juneau-examples-core/target/juneau-examples-core-8.0.0-SNAPSHOT.jar>
[INFO] 
[INFO] --- maven-site-plugin:3.7.1:attach-descriptor (attach-descriptor) @ juneau-examples-core
---
[INFO] Skipping because packaging 'jar' is not pom.
[INFO] 
[INFO] --- maven-assembly-plugin:3.0.0:single (juneau-assembly) @ juneau-examples-core ---
[INFO] Reading assembly descriptor: src/assembly/bin.xml
[WARNING] The assembly descriptor contains a filesystem-root relative reference, which is
not cross platform compatible /
[INFO] Building zip: <https://builds.apache.org/job/Juneau-Java-1.8/ws/juneau-examples/juneau-examples-core/target/juneau-examples-core-8.0.0-SNAPSHOT-bin.zip>
[INFO] 
[INFO] --- apache-rat-plugin:0.12:check (default) @ juneau-examples-core ---
[INFO] Enabled default license matchers.
[INFO] Will parse SCM ignores for exclusions...
[INFO] Parsing exclusions from <https://builds.apache.org/job/Juneau-Java-1.8/ws/juneau-examples/juneau-examples-core/.gitignore>
[INFO] Finished adding exclusions from SCM ignore files.
[INFO] 61 implicit excludes (use -debug for more details).
[INFO] Exclude: **/DEPENDENCIES
[INFO] Exclude: **/target/**
[INFO] Exclude: **/.settings/**
[INFO] Exclude: **/.project
[INFO] Exclude: **/.classpath
[INFO] Exclude: **/*.launch
[INFO] Exclude: **/jetty.out.xml
[INFO] Exclude: **/derby.log
[INFO] Exclude: **/dependency-reduced-pom.xml
[INFO] Exclude: **/docs.txt
[INFO] Exclude: **/toc.txt
[INFO] Exclude: **/app.json
[INFO] Exclude: **/Procfile
[INFO] 17 resources included (use -debug for more details)
[INFO] Rat check: Summary over all files. Unapproved: 3, unknown: 3, generated: 0, approved:
14 licenses.
[INFO] Enabled default license matchers.
[INFO] Will parse SCM ignores for exclusions...
[INFO] Parsing exclusions from <https://builds.apache.org/job/Juneau-Java-1.8/ws/juneau-examples/juneau-examples-core/.gitignore>
[INFO] Finished adding exclusions from SCM ignore files.
[INFO] 61 implicit excludes (use -debug for more details).
[INFO] Exclude: **/DEPENDENCIES
[INFO] Exclude: **/target/**
[INFO] Exclude: **/.settings/**
[INFO] Exclude: **/.project
[INFO] Exclude: **/.classpath
[INFO] Exclude: **/*.launch
[INFO] Exclude: **/jetty.out.xml
[INFO] Exclude: **/derby.log
[INFO] Exclude: **/dependency-reduced-pom.xml
[INFO] Exclude: **/docs.txt
[INFO] Exclude: **/toc.txt
[INFO] Exclude: **/app.json
[INFO] Exclude: **/Procfile
[INFO] 17 resources included (use -debug for more details)
[WARNING] Files with unapproved licenses:
  <https://builds.apache.org/job/Juneau-Java-1.8/ws/juneau-examples/juneau-examples-core/src/main/java/org/apache/juneau/examples/core/json/JsonComplexExample.java>
  <https://builds.apache.org/job/Juneau-Java-1.8/ws/juneau-examples/juneau-examples-core/src/main/java/org/apache/juneau/examples/core/xml/XmlSimpleExample.java>
  <https://builds.apache.org/job/Juneau-Java-1.8/ws/juneau-examples/juneau-examples-core/src/main/java/org/apache/juneau/examples/core/rdf/RdfComplexExample.java>
[INFO]                                                                         
[INFO] ------------------------------------------------------------------------
[INFO] Skipping Apache Juneau
[INFO] This project has been banned from the build due to previous failures.
[INFO] ------------------------------------------------------------------------
[INFO] ------------------------------------------------------------------------
[INFO] Reactor Summary:
[INFO] 
[INFO] Apache Juneau ...................................... SUCCESS [  8.443 s]
[INFO] Apache Juneau - Core APIs .......................... SUCCESS [  4.538 s]
[INFO] Apache Juneau Marshall ............................. SUCCESS [ 40.898 s]
[INFO] Apache Juneau Marshal RDF .......................... SUCCESS [ 11.564 s]
[INFO] Apache Juneau Data Transfer Objects ................ SUCCESS [ 15.127 s]
[INFO] Apache Juneau Core ................................. SUCCESS [ 10.608 s]
[INFO] Apache Juneau Config File API ...................... SUCCESS [ 10.784 s]
[INFO] Apache Juneau Core Tests ........................... SUCCESS [ 54.405 s]
[INFO] Apache Juneau - REST APIs .......................... SUCCESS [  4.190 s]
[INFO] Apache Juneau REST Servlet API ..................... SUCCESS [ 30.505 s]
[INFO] Apache Juneau REST JAX/RS API ...................... SUCCESS [  9.895 s]
[INFO] Apache Juneau REST Servlet API, RDF support ........ SUCCESS [ 14.608 s]
[INFO] Apache Juneau REST Spring Boot Integration ......... SUCCESS [ 13.410 s]
[INFO] Apache Juneau REST Client API ...................... SUCCESS [ 16.198 s]
[INFO] Apache Juneau - Microservice APIs .................. SUCCESS [  4.162 s]
[INFO] Apache Juneau Microservice Core Library ............ SUCCESS [ 10.911 s]
[INFO] Apache Juneau Microservice Server .................. SUCCESS [  6.106 s]
[INFO] Apache Juneau Microservice Template ................ SUCCESS [ 10.685 s]
[INFO] Apache Juneau - Examples ........................... SUCCESS [  4.207 s]
[INFO] Apache Juneau REST Examples ........................ SUCCESS [ 11.100 s]
[INFO] Apache Juneau Microservice Tests ................... SUCCESS [ 39.365 s]
[INFO] Apache Juneau Core Examples ........................ FAILURE [  0.338 s]
[INFO] Apache Juneau REST Examples using Jetty ............ SKIPPED
[INFO] Apache Juneau REST Examples using Spring Boot ...... SKIPPED
[INFO] Apache Juneau Javadocs ............................. SKIPPED
[INFO] Apache Juneau - Release Engineering ................ SKIPPED
[INFO] Apache Juneau UberJar .............................. SKIPPED
[INFO] Apache Juneau Distribution ......................... SKIPPED
[INFO] ------------------------------------------------------------------------
[INFO] BUILD FAILURE
[INFO] ------------------------------------------------------------------------
[INFO] Total time: 05:33 min
[INFO] Finished at: 2018-12-08T20:19:47+00:00
[INFO] Final Memory: 137M/4558M
[INFO] ------------------------------------------------------------------------
[ERROR] Failed to execute goal org.apache.rat:apache-rat-plugin:0.12:check (default) on project
juneau-examples-core: Too many files with unapproved license: 3 See RAT report in: <https://builds.apache.org/job/Juneau-Java-1.8/ws/juneau-examples/juneau-examples-core/target/rat.txt>
-> [Help 1]
[ERROR] 
[ERROR] To see the full stack trace of the errors, re-run Maven with the -e switch.
[ERROR] Re-run Maven using the -X switch to enable full debug logging.
[ERROR] 
[ERROR] For more information about the errors and possible solutions, please read the following
articles:
[ERROR] [Help 1] http://cwiki.apache.org/confluence/display/MAVEN/MojoFailureException
[ERROR] 
[ERROR] After correcting the problems, you can resume the build with the command
[ERROR]   mvn <goals> -rf :juneau-examples-core
Build step 'Invoke top-level Maven targets' marked build as failure
Recording test results
[FINDBUGS] Skipping publisher since build result is FAILURE
[TASKS] Skipping publisher since build result is FAILURE
Publishing Javadoc
Not sending mail to unregistered user kaperera@mitrai.com

Mime
View raw message