juneau-dev mailing list archives

Site index · List index
Message view « Date » · « Thread »
Top « Date » · « Thread »
From Apache Jenkins Server <jenk...@builds.apache.org>
Subject Build failed in Jenkins: Juneau-Java-1.8 #1140
Date Wed, 14 Nov 2018 21:05:36 GMT
See <https://builds.apache.org/job/Juneau-Java-1.8/1140/display/redirect?page=changes>

Changes:

[JamesBognar] Generate toc.txt for website.

------------------------------------------
[...truncated 1.17 MB...]
[INFO] --- maven-jar-plugin:3.1.0:jar (default-jar) @ juneau-examples-core ---
[INFO] Building jar: <https://builds.apache.org/job/Juneau-Java-1.8/ws/juneau-examples/juneau-examples-core/target/juneau-examples-core-8.0.0-SNAPSHOT.jar>
[INFO] 
[INFO] --- maven-site-plugin:3.7.1:attach-descriptor (attach-descriptor) @ juneau-examples-core
---
[INFO] Skipping because packaging 'jar' is not pom.
[INFO] 
[INFO] --- maven-assembly-plugin:3.0.0:single (juneau-assembly) @ juneau-examples-core ---
[INFO] Reading assembly descriptor: src/assembly/bin.xml
[WARNING] The assembly descriptor contains a filesystem-root relative reference, which is
not cross platform compatible /
[INFO] Building zip: <https://builds.apache.org/job/Juneau-Java-1.8/ws/juneau-examples/juneau-examples-core/target/juneau-examples-core-8.0.0-SNAPSHOT-bin.zip>
[INFO] 
[INFO] --- apache-rat-plugin:0.12:check (default) @ juneau-examples-core ---
[INFO] Enabled default license matchers.
[INFO] Will parse SCM ignores for exclusions...
[INFO] Parsing exclusions from <https://builds.apache.org/job/Juneau-Java-1.8/ws/juneau-examples/juneau-examples-core/.gitignore>
[INFO] Finished adding exclusions from SCM ignore files.
[INFO] 61 implicit excludes (use -debug for more details).
[INFO] Exclude: **/DEPENDENCIES
[INFO] Exclude: **/target/**
[INFO] Exclude: **/.settings/**
[INFO] Exclude: **/.project
[INFO] Exclude: **/.classpath
[INFO] Exclude: **/*.launch
[INFO] Exclude: **/jetty.out.xml
[INFO] Exclude: **/dependency-reduced-pom.xml
[INFO] Exclude: **/docs.txt
[INFO] Exclude: **/app.json
[INFO] Exclude: **/Procfile
[INFO] 14 resources included (use -debug for more details)
[INFO] Rat check: Summary over all files. Unapproved: 0, unknown: 0, generated: 0, approved:
14 licenses.
[INFO] 
[INFO] --- maven-install-plugin:2.5.2:install (default-install) @ juneau-examples-core ---
[INFO] Installing <https://builds.apache.org/job/Juneau-Java-1.8/ws/juneau-examples/juneau-examples-core/target/juneau-examples-core-8.0.0-SNAPSHOT.jar>
to /home/jenkins/.m2/repository/org/apache/juneau/juneau-examples-core/8.0.0-SNAPSHOT/juneau-examples-core-8.0.0-SNAPSHOT.jar
[INFO] Installing <https://builds.apache.org/job/Juneau-Java-1.8/ws/juneau-examples/juneau-examples-core/pom.xml>
to /home/jenkins/.m2/repository/org/apache/juneau/juneau-examples-core/8.0.0-SNAPSHOT/juneau-examples-core-8.0.0-SNAPSHOT.pom
[INFO] Installing <https://builds.apache.org/job/Juneau-Java-1.8/ws/juneau-examples/juneau-examples-core/target/juneau-examples-core-8.0.0-SNAPSHOT-bin.zip>
to /home/jenkins/.m2/repository/org/apache/juneau/juneau-examples-core/8.0.0-SNAPSHOT/juneau-examples-core-8.0.0-SNAPSHOT-bin.zip
[INFO] 
[INFO] --- maven-enforcer-plugin:1.4.1:enforce (enforce-maven-version) @ juneau-examples-core
---
[INFO] 
[INFO] --- maven-enforcer-plugin:1.4.1:enforce (enforce-maven) @ juneau-examples-core ---
[INFO] 
[INFO] --- maven-remote-resources-plugin:1.5:process (process-resource-bundles) @ juneau-examples-core
---
[INFO] 
[INFO] --- maven-resources-plugin:3.1.0:resources (default-resources) @ juneau-examples-core
---
[INFO] Using 'UTF-8' encoding to copy filtered resources.
[INFO] Copying 1 resource
[INFO] Copying 3 resources
[INFO] Copying 3 resources
[INFO] 
[INFO] --- maven-compiler-plugin:3.7.0:compile (default-compile) @ juneau-examples-core ---
[INFO] Nothing to compile - all classes are up to date
[INFO] 
[INFO] --- maven-resources-plugin:3.1.0:testResources (default-testResources) @ juneau-examples-core
---
[INFO] Using 'UTF-8' encoding to copy filtered resources.
[INFO] skip non existing resourceDirectory <https://builds.apache.org/job/Juneau-Java-1.8/ws/juneau-examples/juneau-examples-core/src/test/resources>
[INFO] Copying 3 resources
[INFO] Copying 3 resources
[INFO] 
[INFO] --- maven-compiler-plugin:3.7.0:testCompile (default-testCompile) @ juneau-examples-core
---
[INFO] Nothing to compile - all classes are up to date
[INFO] 
[INFO] --- maven-surefire-plugin:2.22.0:test (default-test) @ juneau-examples-core ---
[INFO] Skipping execution of surefire because it has already been run for this configuration
[INFO] 
[INFO] --- maven-jar-plugin:3.1.0:jar (default-jar) @ juneau-examples-core ---
[INFO] 
[INFO] --- maven-site-plugin:3.7.1:attach-descriptor (attach-descriptor) @ juneau-examples-core
---
[INFO] Skipping because packaging 'jar' is not pom.
[INFO] 
[INFO] --- maven-assembly-plugin:3.0.0:single (juneau-assembly) @ juneau-examples-core ---
[INFO] Reading assembly descriptor: src/assembly/bin.xml
[WARNING] The assembly descriptor contains a filesystem-root relative reference, which is
not cross platform compatible /
[INFO] Building zip: <https://builds.apache.org/job/Juneau-Java-1.8/ws/juneau-examples/juneau-examples-core/target/juneau-examples-core-8.0.0-SNAPSHOT-bin.zip>
[INFO] 
[INFO] --- apache-rat-plugin:0.12:check (default) @ juneau-examples-core ---
[INFO] Enabled default license matchers.
[INFO] Will parse SCM ignores for exclusions...
[INFO] Parsing exclusions from <https://builds.apache.org/job/Juneau-Java-1.8/ws/juneau-examples/juneau-examples-core/.gitignore>
[INFO] Finished adding exclusions from SCM ignore files.
[INFO] 61 implicit excludes (use -debug for more details).
[INFO] Exclude: **/DEPENDENCIES
[INFO] Exclude: **/target/**
[INFO] Exclude: **/.settings/**
[INFO] Exclude: **/.project
[INFO] Exclude: **/.classpath
[INFO] Exclude: **/*.launch
[INFO] Exclude: **/jetty.out.xml
[INFO] Exclude: **/dependency-reduced-pom.xml
[INFO] Exclude: **/docs.txt
[INFO] Exclude: **/app.json
[INFO] Exclude: **/Procfile
[INFO] 14 resources included (use -debug for more details)
[INFO] Rat check: Summary over all files. Unapproved: 0, unknown: 0, generated: 0, approved:
14 licenses.
[INFO] 
[INFO] --- maven-install-plugin:2.5.2:install (default-install) @ juneau-examples-core ---
[INFO] Installing <https://builds.apache.org/job/Juneau-Java-1.8/ws/juneau-examples/juneau-examples-core/target/juneau-examples-core-8.0.0-SNAPSHOT.jar>
to /home/jenkins/.m2/repository/org/apache/juneau/juneau-examples-core/8.0.0-SNAPSHOT/juneau-examples-core-8.0.0-SNAPSHOT.jar
[INFO] Installing <https://builds.apache.org/job/Juneau-Java-1.8/ws/juneau-examples/juneau-examples-core/pom.xml>
to /home/jenkins/.m2/repository/org/apache/juneau/juneau-examples-core/8.0.0-SNAPSHOT/juneau-examples-core-8.0.0-SNAPSHOT.pom
[INFO] Installing <https://builds.apache.org/job/Juneau-Java-1.8/ws/juneau-examples/juneau-examples-core/target/juneau-examples-core-8.0.0-SNAPSHOT-bin.zip>
to /home/jenkins/.m2/repository/org/apache/juneau/juneau-examples-core/8.0.0-SNAPSHOT/juneau-examples-core-8.0.0-SNAPSHOT-bin.zip
[INFO] Installing <https://builds.apache.org/job/Juneau-Java-1.8/ws/juneau-examples/juneau-examples-core/target/juneau-examples-core-8.0.0-SNAPSHOT-bin.zip>
to /home/jenkins/.m2/repository/org/apache/juneau/juneau-examples-core/8.0.0-SNAPSHOT/juneau-examples-core-8.0.0-SNAPSHOT-bin.zip
[INFO] 
[INFO] --- maven-deploy-plugin:2.8.2:deploy (default-deploy) @ juneau-examples-core ---
Downloading: https://repository.apache.org/content/repositories/snapshots/org/apache/juneau/juneau-examples-core/8.0.0-SNAPSHOT/maven-metadata.xml
1001/1001 B                 Downloaded: https://repository.apache.org/content/repositories/snapshots/org/apache/juneau/juneau-examples-core/8.0.0-SNAPSHOT/maven-metadata.xml
(1001 B at 1.6 KB/sec)
Uploading: https://repository.apache.org/content/repositories/snapshots/org/apache/juneau/juneau-examples-core/8.0.0-SNAPSHOT/juneau-examples-core-8.0.0-20181114.210517-14.jar
2/16 KB       4/16 KB   6/16 KB   8/16 KB   10/16 KB   12/16 KB   14/16 KB   16/16 KB    
         Uploaded: https://repository.apache.org/content/repositories/snapshots/org/apache/juneau/juneau-examples-core/8.0.0-SNAPSHOT/juneau-examples-core-8.0.0-20181114.210517-14.jar
(16 KB at 15.7 KB/sec)
Uploading: https://repository.apache.org/content/repositories/snapshots/org/apache/juneau/juneau-examples-core/8.0.0-SNAPSHOT/juneau-examples-core-8.0.0-20181114.210517-14.pom
2/4 KB     4/4 KB            Uploaded: https://repository.apache.org/content/repositories/snapshots/org/apache/juneau/juneau-examples-core/8.0.0-SNAPSHOT/juneau-examples-core-8.0.0-20181114.210517-14.pom
(4 KB at 4.1 KB/sec)
Downloading: https://repository.apache.org/content/repositories/snapshots/org/apache/juneau/juneau-examples-core/maven-metadata.xml
579/579 B               Downloaded: https://repository.apache.org/content/repositories/snapshots/org/apache/juneau/juneau-examples-core/maven-metadata.xml
(579 B at 0.9 KB/sec)
Uploading: https://repository.apache.org/content/repositories/snapshots/org/apache/juneau/juneau-examples-core/8.0.0-SNAPSHOT/maven-metadata.xml
1001/1001 B                 Uploaded: https://repository.apache.org/content/repositories/snapshots/org/apache/juneau/juneau-examples-core/8.0.0-SNAPSHOT/maven-metadata.xml
(1001 B at 1.1 KB/sec)
Uploading: https://repository.apache.org/content/repositories/snapshots/org/apache/juneau/juneau-examples-core/maven-metadata.xml
579/579 B                 Uploaded: https://repository.apache.org/content/repositories/snapshots/org/apache/juneau/juneau-examples-core/maven-metadata.xml
(579 B at 0.6 KB/sec)
Uploading: https://repository.apache.org/content/repositories/snapshots/org/apache/juneau/juneau-examples-core/8.0.0-SNAPSHOT/juneau-examples-core-8.0.0-20181114.210517-14-bin.zip
2/21 KB     4/21 KB   6/21 KB   8/21 KB   10/21 KB   12/21 KB   14/21 KB   16/21 KB   18/21
KB   20/21 KB   21/21 KB              Uploaded: https://repository.apache.org/content/repositories/snapshots/org/apache/juneau/juneau-examples-core/8.0.0-SNAPSHOT/juneau-examples-core-8.0.0-20181114.210517-14-bin.zip
(21 KB at 20.5 KB/sec)
Uploading: https://repository.apache.org/content/repositories/snapshots/org/apache/juneau/juneau-examples-core/8.0.0-SNAPSHOT/maven-metadata.xml
1001/1001 B                 Uploaded: https://repository.apache.org/content/repositories/snapshots/org/apache/juneau/juneau-examples-core/8.0.0-SNAPSHOT/maven-metadata.xml
(1001 B at 1.1 KB/sec)
Uploading: https://repository.apache.org/content/repositories/snapshots/org/apache/juneau/juneau-examples-core/8.0.0-SNAPSHOT/juneau-examples-core-8.0.0-20181114.210517-14-bin.zip
2/21 KB       4/21 KB   6/21 KB   8/21 KB   10/21 KB   12/21 KB   14/21 KB   16/21 KB   18/21
KB   20/21 KB   21/21 KB              Uploaded: https://repository.apache.org/content/repositories/snapshots/org/apache/juneau/juneau-examples-core/8.0.0-SNAPSHOT/juneau-examples-core-8.0.0-20181114.210517-14-bin.zip
(21 KB at 20.9 KB/sec)
Uploading: https://repository.apache.org/content/repositories/snapshots/org/apache/juneau/juneau-examples-core/8.0.0-SNAPSHOT/maven-metadata.xml
1001/1001 B                 Uploaded: https://repository.apache.org/content/repositories/snapshots/org/apache/juneau/juneau-examples-core/8.0.0-SNAPSHOT/maven-metadata.xml
(1001 B at 1.1 KB/sec)
[INFO]                                                                         
[INFO] ------------------------------------------------------------------------
[INFO] Building Apache Juneau Javadocs 8.0.0-SNAPSHOT
[INFO] ------------------------------------------------------------------------
[INFO] 
[INFO] --- maven-clean-plugin:3.1.0:clean (default-clean) @ juneau-doc ---
[INFO] Deleting <https://builds.apache.org/job/Juneau-Java-1.8/ws/juneau-doc/target>
[INFO] 
[INFO] --- maven-enforcer-plugin:1.4.1:enforce (enforce-maven-version) @ juneau-doc ---
[INFO] 
[INFO] --- maven-enforcer-plugin:1.4.1:enforce (enforce-maven) @ juneau-doc ---
[INFO] 
[INFO] --- maven-remote-resources-plugin:1.5:process (process-resource-bundles) @ juneau-doc
---
[INFO] 
[INFO] --- maven-resources-plugin:3.1.0:resources (default-resources) @ juneau-doc ---
[INFO] Using 'UTF-8' encoding to copy filtered resources.
[INFO] Copying 487 resources
[INFO] Copying 3 resources
[INFO] 
[INFO] --- maven-compiler-plugin:3.7.0:compile (default-compile) @ juneau-doc ---
[INFO] Changes detected - recompiling the module!
[INFO] Compiling 7 source files to <https://builds.apache.org/job/Juneau-Java-1.8/ws/juneau-doc/target/classes>
[INFO] 
[INFO] --- maven-resources-plugin:3.1.0:testResources (default-testResources) @ juneau-doc
---
[INFO] Using 'UTF-8' encoding to copy filtered resources.
[INFO] skip non existing resourceDirectory <https://builds.apache.org/job/Juneau-Java-1.8/ws/juneau-doc/src/test/resources>
[INFO] Copying 3 resources
[INFO] 
[INFO] --- maven-compiler-plugin:3.7.0:testCompile (default-testCompile) @ juneau-doc ---
[INFO] No sources to compile
[INFO] 
[INFO] --- maven-surefire-plugin:2.22.0:test (default-test) @ juneau-doc ---
[INFO] 
[INFO] --- maven-bundle-plugin:3.2.0:bundle (default-bundle) @ juneau-doc ---
[INFO] 
[INFO] --- maven-site-plugin:3.7.1:attach-descriptor (attach-descriptor) @ juneau-doc ---
[INFO] Skipping because packaging 'bundle' is not pom.
[INFO] 
[INFO] --- apache-rat-plugin:0.12:check (default) @ juneau-doc ---
[INFO] Enabled default license matchers.
[INFO] Will parse SCM ignores for exclusions...
[INFO] Parsing exclusions from <https://builds.apache.org/job/Juneau-Java-1.8/ws/juneau-doc/.gitignore>
[INFO] Finished adding exclusions from SCM ignore files.
[INFO] 62 implicit excludes (use -debug for more details).
[INFO] Exclude: **/DEPENDENCIES
[INFO] Exclude: **/target/**
[INFO] Exclude: **/.settings/**
[INFO] Exclude: **/.project
[INFO] Exclude: **/.classpath
[INFO] Exclude: **/*.launch
[INFO] Exclude: **/jetty.out.xml
[INFO] Exclude: **/dependency-reduced-pom.xml
[INFO] Exclude: **/docs.txt
[INFO] Exclude: **/app.json
[INFO] Exclude: **/Procfile
[INFO] 649 resources included (use -debug for more details)
[INFO] Rat check: Summary over all files. Unapproved: 1, unknown: 1, generated: 0, approved:
366 licenses.
[INFO] Enabled default license matchers.
[INFO] Will parse SCM ignores for exclusions...
[INFO] Parsing exclusions from <https://builds.apache.org/job/Juneau-Java-1.8/ws/juneau-doc/.gitignore>
[INFO] Finished adding exclusions from SCM ignore files.
[INFO] 62 implicit excludes (use -debug for more details).
[INFO] Exclude: **/DEPENDENCIES
[INFO] Exclude: **/target/**
[INFO] Exclude: **/.settings/**
[INFO] Exclude: **/.project
[INFO] Exclude: **/.classpath
[INFO] Exclude: **/*.launch
[INFO] Exclude: **/jetty.out.xml
[INFO] Exclude: **/dependency-reduced-pom.xml
[INFO] Exclude: **/docs.txt
[INFO] Exclude: **/app.json
[INFO] Exclude: **/Procfile
[INFO] 649 resources included (use -debug for more details)
[WARNING] Files with unapproved licenses:
  <https://builds.apache.org/job/Juneau-Java-1.8/ws/juneau-doc/src/main/javadoc/resources/toc.txt>
[INFO]                                                                         
[INFO] ------------------------------------------------------------------------
[INFO] Skipping Apache Juneau
[INFO] This project has been banned from the build due to previous failures.
[INFO] ------------------------------------------------------------------------
[INFO] ------------------------------------------------------------------------
[INFO] Reactor Summary:
[INFO] 
[INFO] Apache Juneau ...................................... SUCCESS [  7.050 s]
[INFO] Apache Juneau - Core APIs .......................... SUCCESS [  4.272 s]
[INFO] Apache Juneau Marshall ............................. SUCCESS [ 33.340 s]
[INFO] Apache Juneau Marshal RDF .......................... SUCCESS [ 10.917 s]
[INFO] Apache Juneau Data Transfer Objects ................ SUCCESS [ 13.812 s]
[INFO] Apache Juneau Core ................................. SUCCESS [ 10.329 s]
[INFO] Apache Juneau Config File API ...................... SUCCESS [ 10.384 s]
[INFO] Apache Juneau Core Tests ........................... SUCCESS [ 57.948 s]
[INFO] Apache Juneau - REST APIs .......................... SUCCESS [  4.149 s]
[INFO] Apache Juneau REST Servlet API ..................... SUCCESS [ 26.531 s]
[INFO] Apache Juneau REST JAX/RS API ...................... SUCCESS [  9.691 s]
[INFO] Apache Juneau REST Client API ...................... SUCCESS [ 14.745 s]
[INFO] Apache Juneau - Microservice APIs .................. SUCCESS [  4.043 s]
[INFO] Apache Juneau Microservice Server .................. SUCCESS [ 11.340 s]
[INFO] Apache Juneau Microservice Template ................ SUCCESS [ 10.167 s]
[INFO] Apache Juneau - Examples ........................... SUCCESS [  4.099 s]
[INFO] Apache Juneau REST Examples ........................ SUCCESS [01:35 min]
[INFO] Apache Juneau Microservice Tests ................... SUCCESS [ 33.555 s]
[INFO] Apache Juneau Core Examples ........................ SUCCESS [  9.229 s]
[INFO] Apache Juneau Javadocs ............................. FAILURE [  3.833 s]
[INFO] Apache Juneau - Release Engineering ................ SKIPPED
[INFO] Apache Juneau UberJar .............................. SKIPPED
[INFO] Apache Juneau Distribution ......................... SKIPPED
[INFO] ------------------------------------------------------------------------
[INFO] BUILD FAILURE
[INFO] ------------------------------------------------------------------------
[INFO] Total time: 06:16 min
[INFO] Finished at: 2018-11-14T21:05:29+00:00
[INFO] Final Memory: 143M/3557M
[INFO] ------------------------------------------------------------------------
[ERROR] Failed to execute goal org.apache.rat:apache-rat-plugin:0.12:check (default) on project
juneau-doc: Too many files with unapproved license: 1 See RAT report in: <https://builds.apache.org/job/Juneau-Java-1.8/ws/juneau-doc/target/rat.txt>
-> [Help 1]
[ERROR] 
[ERROR] To see the full stack trace of the errors, re-run Maven with the -e switch.
[ERROR] Re-run Maven using the -X switch to enable full debug logging.
[ERROR] 
[ERROR] For more information about the errors and possible solutions, please read the following
articles:
[ERROR] [Help 1] http://cwiki.apache.org/confluence/display/MAVEN/MojoFailureException
[ERROR] 
[ERROR] After correcting the problems, you can resume the build with the command
[ERROR]   mvn <goals> -rf :juneau-doc
Build step 'Invoke top-level Maven targets' marked build as failure
Recording test results
[FINDBUGS] Skipping publisher since build result is FAILURE
[TASKS] Skipping publisher since build result is FAILURE
Publishing Javadoc

Mime
View raw message