juneau-dev mailing list archives

Site index · List index
Message view « Date » · « Thread »
Top « Date » · « Thread »
From Apache Jenkins Server <jenk...@builds.apache.org>
Subject Build failed in Jenkins: Juneau-Java-1.8 #1058
Date Mon, 17 Sep 2018 16:21:11 GMT
See <https://builds.apache.org/job/Juneau-Java-1.8/1058/display/redirect?page=changes>

Changes:

[JamesBognar] [maven-release-plugin] prepare release juneau-7.2.0-RC1

[JamesBognar] [maven-release-plugin] prepare for next development iteration

------------------------------------------
[...truncated 1.72 MB...]
[ERROR] public <T> T[] getInstanceArrayProperty(String key, Class<T> type, T[]
def) {
[ERROR] ^
[ERROR] <https://builds.apache.org/job/Juneau-Java-1.8/ws/juneau-core/juneau-marshall/src/main/java/org/apache/juneau/Context.java>:402:
warning: no @param for <T>
[ERROR] public <T> T[] getInstanceArrayProperty(String key, Class<T> type, T[]
def, boolean fuzzyArgs, Object...args) {
[ERROR] ^
[ERROR] <https://builds.apache.org/job/Juneau-Java-1.8/ws/juneau-core/juneau-marshall/src/main/java/org/apache/juneau/Context.java>:422:
warning: no @param for <T>
[ERROR] public <T> T[] getInstanceArrayProperty(String key, Object outer, Class<T>
type, T[] def, boolean fuzzyArgs, Object...args) {
[ERROR] ^
[ERROR] <https://builds.apache.org/job/Juneau-Java-1.8/ws/juneau-core/juneau-marshall/src/main/java/org/apache/juneau/BeanContextBuilder.java>:607:
warning: no @param for <T>
[ERROR] public <T> BeanContextBuilder example(Class<T> pojoClass, T o) {
[ERROR] ^
[ERROR] <https://builds.apache.org/job/Juneau-Java-1.8/ws/juneau-core/juneau-marshall/src/main/java/org/apache/juneau/ContextBuilder.java>:95:
warning: no @param for <T>
[ERROR] public <T extends Context> T build(Class<T> c) {
[ERROR] ^
[ERROR] <https://builds.apache.org/job/Juneau-Java-1.8/ws/juneau-core/juneau-marshall/src/main/java/org/apache/juneau/BeanMeta.java>:769:
warning: no @param for <M>
[ERROR] public <M extends BeanMetaExtended> M getExtendedMeta(Class<M> metaDataClass)
{
[ERROR] ^
[ERROR] <https://builds.apache.org/job/Juneau-Java-1.8/ws/juneau-core/juneau-marshall/src/main/java/org/apache/juneau/BeanPropertyMeta.java>:499:
warning: no @param for <M>
[ERROR] public <M extends BeanPropertyMetaExtended> M getExtendedMeta(Class<M>
c) {
[ERROR] ^
[ERROR] <https://builds.apache.org/job/Juneau-Java-1.8/ws/juneau-core/juneau-marshall/src/main/java/org/apache/juneau/BeanPropertyMeta.java>:1038:
warning: no @param for <A>
[ERROR] public <A extends Annotation> List<A> findAnnotations(Class<A> a)
{
[ERROR] ^
[ERROR] <https://builds.apache.org/job/Juneau-Java-1.8/ws/juneau-core/juneau-marshall/src/main/java/org/apache/juneau/BeanPropertyMeta.java>:1071:
warning: no @param for <A>
[ERROR] public <A extends Annotation> A getAnnotation(Class<A> a) {
[ERROR] ^
[ERROR] <https://builds.apache.org/job/Juneau-Java-1.8/ws/juneau-core/juneau-marshall/src/main/java/org/apache/juneau/BeanSession.java>:999:
warning: no @param for <T>
[ERROR] public final <T> ClassMeta<T> getClassMeta(Type type, Type...args) {
[ERROR] ^
[ERROR] <https://builds.apache.org/job/Juneau-Java-1.8/ws/juneau-core/juneau-marshall/src/main/java/org/apache/juneau/BeanSession.java>:1068:
warning: no @param for <T>
[ERROR] public <T> T newInstance(Class<T> c, Object c2) {
[ERROR] ^
[ERROR] <https://builds.apache.org/job/Juneau-Java-1.8/ws/juneau-core/juneau-marshall/src/main/java/org/apache/juneau/BeanSession.java>:1091:
warning: no @param for <T>
[ERROR] public <T> T newInstance(Class<T> c, Object c2, boolean fuzzyArgs, Object...args)
{
[ERROR] ^
[ERROR] <https://builds.apache.org/job/Juneau-Java-1.8/ws/juneau-core/juneau-marshall/src/main/java/org/apache/juneau/BeanSession.java>:1117:
warning: no @param for <T>
[ERROR] public <T> T newInstanceFromOuter(Object outer, Class<T> c, Object c2,
boolean fuzzyArgs, Object...args) {
[ERROR] ^
[ERROR] <https://builds.apache.org/job/Juneau-Java-1.8/ws/juneau-core/juneau-marshall/src/main/java/org/apache/juneau/Session.java>:85:
warning: no @param for <T>
[ERROR] public final <T> T getProperty(String key, Class<T> type, T def) {
[ERROR] ^
[ERROR] <https://builds.apache.org/job/Juneau-Java-1.8/ws/juneau-core/juneau-marshall/src/main/java/org/apache/juneau/Session.java>:104:
warning: no @param for <T>
[ERROR] public final <T> T getProperty(String key, Class<T> type, T...def) {
[ERROR] ^
[ERROR] <https://builds.apache.org/job/Juneau-Java-1.8/ws/juneau-core/juneau-marshall/src/main/java/org/apache/juneau/Session.java>:117:
warning: no @param for <T>
[ERROR] public final <T> Class<? extends T> getClassProperty(String key, Class<T>
type, Class<? extends T> def) {
[ERROR] ^
[ERROR] <https://builds.apache.org/job/Juneau-Java-1.8/ws/juneau-core/juneau-marshall/src/main/java/org/apache/juneau/Session.java>:130:
warning: no @param for <T>
[ERROR] public <T> T getInstanceProperty(String key, Class<T> type, Object def)
{
[ERROR] ^
[ERROR] <https://builds.apache.org/job/Juneau-Java-1.8/ws/juneau-core/juneau-marshall/src/main/java/org/apache/juneau/Session.java>:143:
warning: no @param for <T>
[ERROR] public <T> T[] getInstanceArrayProperty(String key, Class<T> type, T[]
def) {
[ERROR] ^
[ERROR] <https://builds.apache.org/job/Juneau-Java-1.8/ws/juneau-core/juneau-marshall/src/main/java/org/apache/juneau/Session.java>:246:
warning: no @param for <T>
[ERROR] public final <T> T getFromCache(Class<T> c, String key) {
[ERROR] ^
[ERROR] <https://builds.apache.org/job/Juneau-Java-1.8/ws/juneau-core/juneau-marshall/src/main/java/org/apache/juneau/ClassMeta.java>:961:
warning: no @param for <T>
[ERROR] protected static <T> Constructor<? extends T> findNoArgConstructor(Class<?>
c, Visibility v) {
[ERROR] ^
[ERROR] <https://builds.apache.org/job/Juneau-Java-1.8/ws/juneau-core/juneau-marshall/src/main/java/org/apache/juneau/ClassMeta.java>:1563:
warning: no @param for <M>
[ERROR] public <M extends ClassMetaExtended> M getExtendedMeta(Class<M> c) {
[ERROR] ^
[ERROR] <https://builds.apache.org/job/Juneau-Java-1.8/ws/juneau-core/juneau-marshall/src/main/java/org/apache/juneau/ClassMeta.java>:2152:
warning: no @param for <O>
[ERROR] public <O> O transformTo(Object o, Class<O> c) {
[ERROR] ^
[ERROR] <https://builds.apache.org/job/Juneau-Java-1.8/ws/juneau-core/juneau-marshall/src/main/java/org/apache/juneau/ClassMeta.java>:2164:
warning: no @param for <O>
[ERROR] public <O> O transformTo(Object o, ClassMeta<O> c) {
[ERROR] ^
[ERROR] <https://builds.apache.org/job/Juneau-Java-1.8/ws/juneau-core/juneau-marshall/src/main/java/org/apache/juneau/ClassMeta.java>:2175:
warning: no @param for <I>
[ERROR] public <I> Transform<I,T> getFromTransform(Class<I> c) {
[ERROR] ^
[ERROR] <https://builds.apache.org/job/Juneau-Java-1.8/ws/juneau-core/juneau-marshall/src/main/java/org/apache/juneau/ClassMeta.java>:2195:
warning: no @param for <O>
[ERROR] public <O> Transform<T,O> getToTransform(Class<O> c) {
[ERROR] ^
[ERROR] <https://builds.apache.org/job/Juneau-Java-1.8/ws/juneau-core/juneau-marshall/src/main/java/org/apache/juneau/ContextCache.java>:98:
warning: no @param for <T>
[ERROR] public <T extends Context> T create(Class<T> c, PropertyStore ps) {
[ERROR] ^
[ERROR] <https://builds.apache.org/job/Juneau-Java-1.8/ws/juneau-core/juneau-marshall/src/main/java/org/apache/juneau/ObjectList.java>:449:
warning: no @param for <K>
[ERROR] public <K,V> Map<K,V> getMap(int index, Class<K> keyType, Class<V>
valType) {
[ERROR] ^
[ERROR] <https://builds.apache.org/job/Juneau-Java-1.8/ws/juneau-core/juneau-marshall/src/main/java/org/apache/juneau/ObjectList.java>:449:
warning: no @param for <V>
[ERROR] public <K,V> Map<K,V> getMap(int index, Class<K> keyType, Class<V>
valType) {
[ERROR] ^
[ERROR] <https://builds.apache.org/job/Juneau-Java-1.8/ws/juneau-core/juneau-marshall/src/main/java/org/apache/juneau/ObjectList.java>:472:
warning: no @param for <E>
[ERROR] public <E> List<E> getList(int index, Class<E> elementType) {
[ERROR] ^
[ERROR] <https://builds.apache.org/job/Juneau-Java-1.8/ws/juneau-core/juneau-marshall/src/main/java/org/apache/juneau/ObjectMap.java>:966:
warning: no @param for <K>
[ERROR] public <K,V> Map<K,V> getMap(String key, Class<K> keyType, Class<V>
valType, Map<K,V> def) {
[ERROR] ^
[ERROR] <https://builds.apache.org/job/Juneau-Java-1.8/ws/juneau-core/juneau-marshall/src/main/java/org/apache/juneau/ObjectMap.java>:966:
warning: no @param for <V>
[ERROR] public <K,V> Map<K,V> getMap(String key, Class<K> keyType, Class<V>
valType, Map<K,V> def) {
[ERROR] ^
[ERROR] <https://builds.apache.org/job/Juneau-Java-1.8/ws/juneau-core/juneau-marshall/src/main/java/org/apache/juneau/ObjectMap.java>:1011:
warning: no @param for <E>
[ERROR] public <E> List<E> getList(String key, Class<E> elementType, List<E>
def) {
[ERROR] ^
[ERROR] <https://builds.apache.org/job/Juneau-Java-1.8/ws/juneau-core/juneau-marshall/src/main/java/org/apache/juneau/PropertyStore.java>:262:
warning: no @param for <T>
[ERROR] public <T> T getProperty(String key, Class<T> c, T def) {
[ERROR] ^
[ERROR] <https://builds.apache.org/job/Juneau-Java-1.8/ws/juneau-core/juneau-marshall/src/main/java/org/apache/juneau/PropertyStore.java>:275:
warning: no @param for <T>
[ERROR] public <T> Class<? extends T> getClassProperty(String key, Class<T>
type, Class<? extends T> def) {
[ERROR] ^
[ERROR] <https://builds.apache.org/job/Juneau-Java-1.8/ws/juneau-core/juneau-marshall/src/main/java/org/apache/juneau/PropertyStore.java>:287:
warning: no @param for <T>
[ERROR] public <T> T[] getArrayProperty(String key, Class<T> eType) {
[ERROR] ^
[ERROR] <https://builds.apache.org/job/Juneau-Java-1.8/ws/juneau-core/juneau-marshall/src/main/java/org/apache/juneau/PropertyStore.java>:300:
warning: no @param for <T>
[ERROR] public <T> T[] getArrayProperty(String key, Class<T> eType, T[] def) {
[ERROR] ^
[ERROR] <https://builds.apache.org/job/Juneau-Java-1.8/ws/juneau-core/juneau-marshall/src/main/java/org/apache/juneau/PropertyStore.java>:335:
warning: no @param for <T>
[ERROR] public <T> Class<T>[] getClassArrayProperty(String key, Class<T>
eType) {
[ERROR] ^
[ERROR] <https://builds.apache.org/job/Juneau-Java-1.8/ws/juneau-core/juneau-marshall/src/main/java/org/apache/juneau/PropertyStore.java>:347:
warning: no @param for <T>
[ERROR] public <T> Set<T> getSetProperty(String key, Class<T> eType) {
[ERROR] ^
[ERROR] <https://builds.apache.org/job/Juneau-Java-1.8/ws/juneau-core/juneau-marshall/src/main/java/org/apache/juneau/PropertyStore.java>:360:
warning: no @param for <T>
[ERROR] public <T> Set<T> getSetProperty(String key, Class<T> eType, Set<T>
def) {
[ERROR] ^
[ERROR] <https://builds.apache.org/job/Juneau-Java-1.8/ws/juneau-core/juneau-marshall/src/main/java/org/apache/juneau/PropertyStore.java>:383:
warning: no @param for <T>
[ERROR] public <T> Set<Class<T>> getClassSetProperty(String key, Class<T>
eType) {
[ERROR] ^
[ERROR] <https://builds.apache.org/job/Juneau-Java-1.8/ws/juneau-core/juneau-marshall/src/main/java/org/apache/juneau/PropertyStore.java>:395:
warning: no @param for <T>
[ERROR] public <T> List<T> getListProperty(String key, Class<T> eType) {
[ERROR] ^
[ERROR] <https://builds.apache.org/job/Juneau-Java-1.8/ws/juneau-core/juneau-marshall/src/main/java/org/apache/juneau/PropertyStore.java>:408:
warning: no @param for <T>
[ERROR] public <T> List<T> getListProperty(String key, Class<T> eType, List<T>
def) {
[ERROR] ^
[ERROR] <https://builds.apache.org/job/Juneau-Java-1.8/ws/juneau-core/juneau-marshall/src/main/java/org/apache/juneau/PropertyStore.java>:431:
warning: no @param for <T>
[ERROR] public <T> List<Class<T>> getClassListProperty(String key, Class<T>
eType) {
[ERROR] ^
[ERROR] <https://builds.apache.org/job/Juneau-Java-1.8/ws/juneau-core/juneau-marshall/src/main/java/org/apache/juneau/PropertyStore.java>:443:
warning: no @param for <T>
[ERROR] public <T> Map<String,T> getMapProperty(String key, Class<T> eType)
{
[ERROR] ^
[ERROR] <https://builds.apache.org/job/Juneau-Java-1.8/ws/juneau-core/juneau-marshall/src/main/java/org/apache/juneau/PropertyStore.java>:466:
warning: no @param for <T>
[ERROR] public <T> Map<String,Class<T>> getClassMapProperty(String key,
Class<T> eType) {
[ERROR] ^
[ERROR] <https://builds.apache.org/job/Juneau-Java-1.8/ws/juneau-core/juneau-marshall/src/main/java/org/apache/juneau/PropertyStore.java>:485:
warning: no @param for <T>
[ERROR] public <T> T getInstanceProperty(String key, Class<T> type, Object def)
{
[ERROR] ^
[ERROR] <https://builds.apache.org/job/Juneau-Java-1.8/ws/juneau-core/juneau-marshall/src/main/java/org/apache/juneau/PropertyStore.java>:506:
warning: no @param for <T>
[ERROR] public <T> T getInstanceProperty(String key, Class<T> type, Object def,
boolean fuzzyArgs, Object...args) {
[ERROR] ^
[ERROR] <https://builds.apache.org/job/Juneau-Java-1.8/ws/juneau-core/juneau-marshall/src/main/java/org/apache/juneau/PropertyStore.java>:528:
warning: no @param for <T>
[ERROR] public <T> T getInstanceProperty(String key, Object outer, Class<T> type,
Object def, boolean fuzzyArgs, Object...args) {
[ERROR] ^
[ERROR] <https://builds.apache.org/job/Juneau-Java-1.8/ws/juneau-core/juneau-marshall/src/main/java/org/apache/juneau/PropertyStore.java>:549:
warning: no @param for <T>
[ERROR] public <T> T[] getInstanceArrayProperty(String key, Class<T> type, T[]
def) {
[ERROR] ^
[ERROR] <https://builds.apache.org/job/Juneau-Java-1.8/ws/juneau-core/juneau-marshall/src/main/java/org/apache/juneau/PropertyStore.java>:568:
warning: no @param for <T>
[ERROR] public <T> T[] getInstanceArrayProperty(String key, Class<T> type, T[]
def, boolean fuzzyArgs, Object...args) {
[ERROR] ^
[ERROR] <https://builds.apache.org/job/Juneau-Java-1.8/ws/juneau-core/juneau-marshall/src/main/java/org/apache/juneau/PropertyStore.java>:588:
warning: no @param for <T>
[ERROR] public <T> T[] getInstanceArrayProperty(String key, Object outer, Class<T>
type, T[] def, boolean fuzzyArgs, Object...args) {
[ERROR] ^
[ERROR] <https://builds.apache.org/job/Juneau-Java-1.8/ws/juneau-core/juneau-marshall/src/main/java/org/apache/juneau/Setter.java>:27:
warning: no description for @throws
[ERROR] * @throws Exception
[ERROR] ^
[ERROR] <https://builds.apache.org/job/Juneau-Java-1.8/ws/juneau-core/juneau-marshall/src/main/java/org/apache/juneau/Streamable.java>:31:
warning: no description for @throws
[ERROR] * @throws IOException
[ERROR] ^
[ERROR] <https://builds.apache.org/job/Juneau-Java-1.8/ws/juneau-core/juneau-marshall/src/main/java/org/apache/juneau/ValueListener.java>:17:
warning: no description for @param
[ERROR] * @param <T>
[ERROR] ^
[ERROR] <https://builds.apache.org/job/Juneau-Java-1.8/ws/juneau-core/juneau-marshall/src/main/java/org/apache/juneau/Visibility.java>:116:
warning: no @param for <T>
[ERROR] public <T> Constructor<T> transform(Constructor<T> x) {
[ERROR] ^
[ERROR] <https://builds.apache.org/job/Juneau-Java-1.8/ws/juneau-core/juneau-marshall/src/main/java/org/apache/juneau/Writable.java>:32:
warning: no description for @throws
[ERROR] * @throws IOException
[ERROR] ^
[ERROR] <https://builds.apache.org/job/Juneau-Java-1.8/ws/juneau-core/juneau-marshall/src/main/java/org/apache/juneau/httppart/HttpPartParser.java>:74:
warning: no @param for <T>
[ERROR] public <T> T parse(HttpPartType partType, HttpPartSchema schema, String in,
Class<T> toType) throws ParseException, SchemaValidationException;
[ERROR] ^
[ERROR] <https://builds.apache.org/job/Juneau-Java-1.8/ws/juneau-core/juneau-marshall/src/main/java/org/apache/juneau/httppart/HttpPartParser.java>:91:
warning: no @param for <T>
[ERROR] public <T> T parse(HttpPartType partType, HttpPartSchema schema, String in,
Type toType, Type...toTypeArgs) throws ParseException, SchemaValidationException;
[ERROR] ^
[ERROR] <https://builds.apache.org/job/Juneau-Java-1.8/ws/juneau-core/juneau-marshall/src/main/java/org/apache/juneau/httppart/HttpPartParser.java>:106:
warning: no @param for <T>
[ERROR] public <T> T parse(HttpPartSchema schema, String in, Class<T> toType)
throws ParseException, SchemaValidationException;
[ERROR] ^
[ERROR] <https://builds.apache.org/job/Juneau-Java-1.8/ws/juneau-core/juneau-marshall/src/main/java/org/apache/juneau/httppart/HttpPartParser.java>:122:
warning: no @param for <T>
[ERROR] public <T> T parse(HttpPartSchema schema, String in, Type toType, Type...toTypeArgs)
throws ParseException, SchemaValidationException;
[ERROR] ^
[ERROR] <https://builds.apache.org/job/Juneau-Java-1.8/ws/juneau-core/juneau-marshall/src/main/java/org/apache/juneau/uon/UonParserSession.java>:178:
warning: no description for @throws
[ERROR] * @throws Exception
[ERROR] ^
[ERROR] <https://builds.apache.org/job/Juneau-Java-1.8/ws/juneau-core/juneau-marshall/src/main/java/org/apache/juneau/uon/UonParserSession.java>:180:
warning: no @param for <T>
[ERROR] public <T> T parseAnything(ClassMeta<?> eType, UonReader r, Object outer,
boolean isUrlParamValue, BeanPropertyMeta pMeta) throws Exception {
[ERROR] ^
[ERROR] <https://builds.apache.org/job/Juneau-Java-1.8/ws/juneau-core/juneau-marshall/src/main/java/org/apache/juneau/uon/UonParserSession.java>:624:
warning: no description for @param
[ERROR] * @param r
[ERROR] ^
[ERROR] <https://builds.apache.org/job/Juneau-Java-1.8/ws/juneau-core/juneau-marshall/src/main/java/org/apache/juneau/uon/UonParserSession.java>:625:
warning: no description for @param
[ERROR] * @param encoded
[ERROR] ^
[ERROR] <https://builds.apache.org/job/Juneau-Java-1.8/ws/juneau-core/juneau-marshall/src/main/java/org/apache/juneau/uon/UonParserSession.java>:627:
warning: no description for @throws
[ERROR] * @throws Exception
[ERROR] ^
[ERROR] <https://builds.apache.org/job/Juneau-Java-1.8/ws/juneau-core/juneau-marshall/src/main/java/org/apache/juneau/uon/UonParserSession.java>:638:
warning: no description for @param
[ERROR] * @param r
[ERROR] ^
[ERROR] <https://builds.apache.org/job/Juneau-Java-1.8/ws/juneau-core/juneau-marshall/src/main/java/org/apache/juneau/uon/UonParserSession.java>:639:
warning: no description for @param
[ERROR] * @param encoded
[ERROR] ^
[ERROR] <https://builds.apache.org/job/Juneau-Java-1.8/ws/juneau-core/juneau-marshall/src/main/java/org/apache/juneau/uon/UonParserSession.java>:641:
warning: no description for @throws
[ERROR] * @throws Exception
[ERROR] ^
[ERROR] <https://builds.apache.org/job/Juneau-Java-1.8/ws/juneau-core/juneau-marshall/src/main/java/org/apache/juneau/uon/UonParserSession.java>:708:
warning: no description for @param
[ERROR] * @param r
[ERROR] ^
[ERROR] <https://builds.apache.org/job/Juneau-Java-1.8/ws/juneau-core/juneau-marshall/src/main/java/org/apache/juneau/uon/UonParserSession.java>:709:
warning: no description for @param
[ERROR] * @param isUrlParamValue
[ERROR] ^
[ERROR] <https://builds.apache.org/job/Juneau-Java-1.8/ws/juneau-core/juneau-marshall/src/main/java/org/apache/juneau/uon/UonParserSession.java>:711:
warning: no description for @throws
[ERROR] * @throws Exception
[ERROR] ^
[ERROR] <https://builds.apache.org/job/Juneau-Java-1.8/ws/juneau-core/juneau-marshall/src/main/java/org/apache/juneau/uon/UonParserSession.java>:831:
warning: no description for @throws
[ERROR] * @throws Exception
[ERROR] ^
[ERROR] <https://builds.apache.org/job/Juneau-Java-1.8/ws/juneau-core/juneau-marshall/src/main/java/org/apache/juneau/httppart/HttpPartParserSession.java>:43:
warning: no @param for <T>
[ERROR] public <T> T parse(HttpPartType partType, HttpPartSchema schema, String in,
ClassMeta<T> toType) throws ParseException, SchemaValidationException;
[ERROR] ^
[ERROR] <https://builds.apache.org/job/Juneau-Java-1.8/ws/juneau-core/juneau-marshall/src/main/java/org/apache/juneau/httppart/HttpPartParserSession.java>:59:
warning: no @param for <T>
[ERROR] public <T> T parse(HttpPartType partType, HttpPartSchema schema, String in,
Class<T> toType) throws ParseException, SchemaValidationException;
[ERROR] ^
[ERROR] <https://builds.apache.org/job/Juneau-Java-1.8/ws/juneau-core/juneau-marshall/src/main/java/org/apache/juneau/httppart/HttpPartParserSession.java>:76:
warning: no @param for <T>
[ERROR] public <T> T parse(HttpPartType partType, HttpPartSchema schema, String in,
Type toType, Type...toTypeArgs) throws ParseException, SchemaValidationException;
[ERROR] ^
[ERROR] <https://builds.apache.org/job/Juneau-Java-1.8/ws/juneau-core/juneau-marshall/src/main/java/org/apache/juneau/httppart/HttpPartParserSession.java>:91:
warning: no @param for <T>
[ERROR] public <T> T parse(HttpPartSchema schema, String in, ClassMeta<T> toType)
throws ParseException, SchemaValidationException;
[ERROR] ^
[ERROR] <https://builds.apache.org/job/Juneau-Java-1.8/ws/juneau-core/juneau-marshall/src/main/java/org/apache/juneau/httppart/HttpPartParserSession.java>:106:
warning: no @param for <T>
[ERROR] public <T> T parse(HttpPartSchema schema, String in, Class<T> toType)
throws ParseException, SchemaValidationException;
[ERROR] ^
[ERROR] <https://builds.apache.org/job/Juneau-Java-1.8/ws/juneau-core/juneau-marshall/src/main/java/org/apache/juneau/httppart/HttpPartParserSession.java>:122:
warning: no @param for <T>
[ERROR] public <T> T parse(HttpPartSchema schema, String in, Type toType, Type...toTypeArgs)
throws ParseException, SchemaValidationException;
[ERROR] ^
[ERROR] 
[ERROR] Command line was: /usr/local/asfpackages/java/jdk1.8.0_172/jre/../bin/javadoc @options
@packages
[ERROR] 
[ERROR] Refer to the generated Javadoc files in '<https://builds.apache.org/job/Juneau-Java-1.8/ws/target/site/apidocs'>
dir.
[ERROR] -> [Help 1]
[ERROR] 
[ERROR] To see the full stack trace of the errors, re-run Maven with the -e switch.
[ERROR] Re-run Maven using the -X switch to enable full debug logging.
[ERROR] 
[ERROR] For more information about the errors and possible solutions, please read the following
articles:
[ERROR] [Help 1] http://cwiki.apache.org/confluence/display/MAVEN/MojoExecutionException
Build step 'Invoke top-level Maven targets' marked build as failure
Recording test results
[FINDBUGS] Skipping publisher since build result is FAILURE
[TASKS] Skipping publisher since build result is FAILURE
Publishing Javadoc

Mime
View raw message