juneau-dev mailing list archives

Site index · List index
Message view « Date » · « Thread »
Top « Date » · « Thread »
From Apache Jenkins Server <jenk...@builds.apache.org>
Subject Build failed in Jenkins: Juneau-Java-1.8 #1073
Date Sat, 29 Sep 2018 18:54:37 GMT
See <https://builds.apache.org/job/Juneau-Java-1.8/1073/display/redirect?page=changes>

Changes:

[JamesBognar] Improvements to @Schema support.

------------------------------------------
Started by an SCM change
Started by an SCM change
[EnvInject] - Loading node environment variables.
Building remotely on ubuntu-1 (ubuntu trusty) in workspace <https://builds.apache.org/job/Juneau-Java-1.8/ws/>
 > git rev-parse --is-inside-work-tree # timeout=10
Fetching changes from the remote Git repository
 > git config remote.origin.url https://github.com/apache/juneau.git # timeout=10
Fetching upstream changes from https://github.com/apache/juneau.git
 > git --version # timeout=10
 > git fetch --tags --progress https://github.com/apache/juneau.git +refs/heads/*:refs/remotes/origin/*
 > git rev-parse refs/remotes/origin/master^{commit} # timeout=10
 > git rev-parse refs/remotes/origin/origin/master^{commit} # timeout=10
Checking out Revision a186a1592431137f34db9b4f443de1323a023b14 (refs/remotes/origin/master)
 > git config core.sparsecheckout # timeout=10
 > git checkout -f a186a1592431137f34db9b4f443de1323a023b14
Commit message: "Improvements to @Schema support."
 > git rev-list --no-walk d4f30682d05e3f12b4be9d2cbe83b73001e9d5de # timeout=10
[Juneau-Java-1.8] $ /home/jenkins/tools/maven/apache-maven-3.2.5/bin/mvn clean install deploy
javadoc:aggregate
[INFO] Scanning for projects...
[WARNING] 
[WARNING] Some problems were encountered while building the effective model for org.apache.juneau:juneau-doc:bundle:7.2.1-SNAPSHOT
[WARNING] 'dependencies.dependency.systemPath' for com.sun:tools:jar should not point at files
within the project directory, ${basedir}/tools.jar will be unresolvable by dependent projects
@ org.apache.juneau:juneau-doc:[unknown-version], <https://builds.apache.org/job/Juneau-Java-1.8/ws/juneau-doc/pom.xml,>
line 100, column 19
[WARNING] 
[WARNING] It is highly recommended to fix these problems because they threaten the stability
of your build.
[WARNING] 
[WARNING] For this reason, future Maven versions might no longer support building such malformed
projects.
[WARNING] 
[INFO] ------------------------------------------------------------------------
[INFO] Reactor Build Order:
[INFO] 
[INFO] Apache Juneau
[INFO] Apache Juneau - Core APIs
[INFO] Apache Juneau Marshall
[INFO] Apache Juneau Marshal RDF
[INFO] Apache Juneau Data Transfer Objects
[INFO] Apache Juneau Core
[INFO] Apache Juneau Config File API
[INFO] Apache Juneau Core Tests
[INFO] Apache Juneau - REST APIs
[INFO] Apache Juneau REST Servlet API
[INFO] Apache Juneau REST JAX/RS API
[INFO] Apache Juneau REST Client API
[INFO] Apache Juneau - Microservice APIs
[INFO] Apache Juneau Microservice Server
[INFO] Apache Juneau Microservice Template
[INFO] Apache Juneau - Examples
[INFO] Apache Juneau REST Examples
[INFO] Apache Juneau Microservice Tests
[INFO] Apache Juneau Core Examples
[INFO] Apache Juneau Javadocs
[INFO] Apache Juneau - Release Engineering
[INFO] Apache Juneau UberJar
[INFO] Apache Juneau Distribution
[INFO]                                                                         
[INFO] ------------------------------------------------------------------------
[INFO] Building Apache Juneau 7.2.1-SNAPSHOT
[INFO] ------------------------------------------------------------------------
[INFO] 
[INFO] --- maven-clean-plugin:3.1.0:clean (default-clean) @ juneau ---
[INFO] Deleting <https://builds.apache.org/job/Juneau-Java-1.8/ws/target>
[INFO] 
[INFO] --- maven-enforcer-plugin:1.4.1:enforce (enforce-maven-version) @ juneau ---
[INFO] 
[INFO] --- maven-enforcer-plugin:1.4.1:enforce (enforce-maven) @ juneau ---
[INFO] 
[INFO] --- maven-remote-resources-plugin:1.5:process (process-resource-bundles) @ juneau ---
[INFO] 
[INFO] --- maven-site-plugin:3.7.1:attach-descriptor (attach-descriptor) @ juneau ---
[INFO] No site descriptor found: nothing to attach.
[INFO] 
[INFO] --- apache-rat-plugin:0.12:check (default) @ juneau ---
[INFO] Enabled default license matchers.
[INFO] Will parse SCM ignores for exclusions...
[INFO] Parsing exclusions from <https://builds.apache.org/job/Juneau-Java-1.8/ws/.gitignore>
[INFO] Finished adding exclusions from SCM ignore files.
[INFO] 68 implicit excludes (use -debug for more details).
[INFO] Exclude: **/DEPENDENCIES
[INFO] Exclude: **/target/**
[INFO] Exclude: **/.settings/**
[INFO] Exclude: **/.project
[INFO] Exclude: **/.classpath
[INFO] Exclude: **/*.launch
[INFO] Exclude: **/jetty.out.xml
[INFO] Exclude: **/dependency-reduced-pom.xml
[INFO] Exclude: **/docs.txt
[INFO] 14 resources included (use -debug for more details)
[INFO] Rat check: Summary over all files. Unapproved: 0, unknown: 0, generated: 0, approved:
11 licenses.
[INFO] 
[INFO] --- maven-install-plugin:2.5.2:install (default-install) @ juneau ---
[INFO] Installing <https://builds.apache.org/job/Juneau-Java-1.8/ws/pom.xml> to /home/jenkins/.m2/repository/org/apache/juneau/juneau/7.2.1-SNAPSHOT/juneau-7.2.1-SNAPSHOT.pom
[INFO] 
[INFO] --- maven-enforcer-plugin:1.4.1:enforce (enforce-maven-version) @ juneau ---
[INFO] 
[INFO] --- maven-enforcer-plugin:1.4.1:enforce (enforce-maven) @ juneau ---
[INFO] 
[INFO] --- maven-remote-resources-plugin:1.5:process (process-resource-bundles) @ juneau ---
[INFO] 
[INFO] --- maven-site-plugin:3.7.1:attach-descriptor (attach-descriptor) @ juneau ---
[INFO] No site descriptor found: nothing to attach.
[INFO] 
[INFO] --- apache-rat-plugin:0.12:check (default) @ juneau ---
[INFO] Enabled default license matchers.
[INFO] Will parse SCM ignores for exclusions...
[INFO] Parsing exclusions from <https://builds.apache.org/job/Juneau-Java-1.8/ws/.gitignore>
[INFO] Finished adding exclusions from SCM ignore files.
[INFO] 68 implicit excludes (use -debug for more details).
[INFO] Exclude: **/DEPENDENCIES
[INFO] Exclude: **/target/**
[INFO] Exclude: **/.settings/**
[INFO] Exclude: **/.project
[INFO] Exclude: **/.classpath
[INFO] Exclude: **/*.launch
[INFO] Exclude: **/jetty.out.xml
[INFO] Exclude: **/dependency-reduced-pom.xml
[INFO] Exclude: **/docs.txt
[INFO] 14 resources included (use -debug for more details)
[INFO] Rat check: Summary over all files. Unapproved: 0, unknown: 0, generated: 0, approved:
11 licenses.
[INFO] 
[INFO] --- maven-install-plugin:2.5.2:install (default-install) @ juneau ---
[INFO] Installing <https://builds.apache.org/job/Juneau-Java-1.8/ws/pom.xml> to /home/jenkins/.m2/repository/org/apache/juneau/juneau/7.2.1-SNAPSHOT/juneau-7.2.1-SNAPSHOT.pom
[INFO] 
[INFO] --- maven-deploy-plugin:2.8.2:deploy (default-deploy) @ juneau ---
Downloading: https://repository.apache.org/content/repositories/snapshots/org/apache/juneau/juneau/7.2.1-SNAPSHOT/maven-metadata.xml
602/602 B               Downloaded: https://repository.apache.org/content/repositories/snapshots/org/apache/juneau/juneau/7.2.1-SNAPSHOT/maven-metadata.xml
(602 B at 0.6 KB/sec)
Uploading: https://repository.apache.org/content/repositories/snapshots/org/apache/juneau/juneau/7.2.1-SNAPSHOT/juneau-7.2.1-20180929.185434-12.pom
2/12 KB     4/12 KB   6/12 KB   8/12 KB   10/12 KB   12/12 KB              [INFO]        
                                                                
[INFO] ------------------------------------------------------------------------
[INFO] Skipping Apache Juneau
[INFO] This project has been banned from the build due to previous failures.
[INFO] ------------------------------------------------------------------------
[INFO] ------------------------------------------------------------------------
[INFO] Reactor Summary:
[INFO] 
[INFO] Apache Juneau ...................................... FAILURE [  8.843 s]
[INFO] Apache Juneau - Core APIs .......................... SKIPPED
[INFO] Apache Juneau Marshall ............................. SKIPPED
[INFO] Apache Juneau Marshal RDF .......................... SKIPPED
[INFO] Apache Juneau Data Transfer Objects ................ SKIPPED
[INFO] Apache Juneau Core ................................. SKIPPED
[INFO] Apache Juneau Config File API ...................... SKIPPED
[INFO] Apache Juneau Core Tests ........................... SKIPPED
[INFO] Apache Juneau - REST APIs .......................... SKIPPED
[INFO] Apache Juneau REST Servlet API ..................... SKIPPED
[INFO] Apache Juneau REST JAX/RS API ...................... SKIPPED
[INFO] Apache Juneau REST Client API ...................... SKIPPED
[INFO] Apache Juneau - Microservice APIs .................. SKIPPED
[INFO] Apache Juneau Microservice Server .................. SKIPPED
[INFO] Apache Juneau Microservice Template ................ SKIPPED
[INFO] Apache Juneau - Examples ........................... SKIPPED
[INFO] Apache Juneau REST Examples ........................ SKIPPED
[INFO] Apache Juneau Microservice Tests ................... SKIPPED
[INFO] Apache Juneau Core Examples ........................ SKIPPED
[INFO] Apache Juneau Javadocs ............................. SKIPPED
[INFO] Apache Juneau - Release Engineering ................ SKIPPED
[INFO] Apache Juneau UberJar .............................. SKIPPED
[INFO] Apache Juneau Distribution ......................... SKIPPED
[INFO] ------------------------------------------------------------------------
[INFO] BUILD FAILURE
[INFO] ------------------------------------------------------------------------
[INFO] Total time: 11.424 s
[INFO] Finished at: 2018-09-29T18:54:35+00:00
[INFO] Final Memory: 30M/614M
[INFO] ------------------------------------------------------------------------
[ERROR] Failed to execute goal org.apache.maven.plugins:maven-deploy-plugin:2.8.2:deploy (default-deploy)
on project juneau: Failed to deploy artifacts: Could not transfer artifact org.apache.juneau:juneau:pom:7.2.1-20180929.185434-12
from/to apache.snapshots.https (https://repository.apache.org/content/repositories/snapshots):
Failed to transfer file: https://repository.apache.org/content/repositories/snapshots/org/apache/juneau/juneau/7.2.1-SNAPSHOT/juneau-7.2.1-20180929.185434-12.pom.
Return code is: 401, ReasonPhrase: Unauthorized. -> [Help 1]
[ERROR] 
[ERROR] To see the full stack trace of the errors, re-run Maven with the -e switch.
[ERROR] Re-run Maven using the -X switch to enable full debug logging.
[ERROR] 
[ERROR] For more information about the errors and possible solutions, please read the following
articles:
[ERROR] [Help 1] http://cwiki.apache.org/confluence/display/MAVEN/MojoExecutionException
Build step 'Invoke top-level Maven targets' marked build as failure
Recording test results
ERROR: Step ?Publish JUnit test result report? failed: Test reports were found but none of
them are new. Did leafNodes run? 
For example, <https://builds.apache.org/job/Juneau-Java-1.8/ws/juneau-core/juneau-core-test/target/surefire-reports/TEST-org.apache.juneau.AnnotationsTest.xml>
is 8 days 21 hr old

[FINDBUGS] Skipping publisher since build result is FAILURE
[TASKS] Skipping publisher since build result is FAILURE
Publishing Javadoc

Mime
View raw message