juneau-dev mailing list archives

Site index · List index
Message view « Date » · « Thread »
Top « Date » · « Thread »
From Apache Jenkins Server <jenk...@builds.apache.org>
Subject Build failed in Jenkins: Juneau-Java-1.8 #1054
Date Sun, 16 Sep 2018 21:42:21 GMT
See <https://builds.apache.org/job/Juneau-Java-1.8/1054/display/redirect?page=changes>

Changes:

[JamesBognar] Bug in SwaggerGenerator with bean with read-only properties.

------------------------------------------
[...truncated 235.57 KB...]
[INFO] 54 implicit excludes (use -debug for more details).
[INFO] Exclude: **/DEPENDENCIES
[INFO] Exclude: **/target/**
[INFO] Exclude: **/.settings/**
[INFO] Exclude: **/.project
[INFO] Exclude: **/.classpath
[INFO] Exclude: **/*.launch
[INFO] Exclude: **/jetty.out.xml
[INFO] Exclude: **/dependency-reduced-pom.xml
[INFO] Exclude: **/docs.txt
[INFO] 1 resources included (use -debug for more details)
[INFO] Rat check: Summary of files. Unapproved: 0 unknown: 0 generated: 0 approved: 1 licence.
[INFO] 
[INFO] --- maven-install-plugin:2.5.2:install (default-install) @ juneau-rest ---
[INFO] Installing <https://builds.apache.org/job/Juneau-Java-1.8/ws/juneau-rest/pom.xml>
to /home/jenkins/.m2/repository/org/apache/juneau/juneau-rest/7.2.0-SNAPSHOT/juneau-rest-7.2.0-SNAPSHOT.pom
[INFO] 
[INFO] --- maven-deploy-plugin:2.8.2:deploy (default-deploy) @ juneau-rest ---
Downloading: https://repository.apache.org/content/repositories/snapshots/org/apache/juneau/juneau-rest/7.2.0-SNAPSHOT/maven-metadata.xml
607/607 B               Downloaded: https://repository.apache.org/content/repositories/snapshots/org/apache/juneau/juneau-rest/7.2.0-SNAPSHOT/maven-metadata.xml
(607 B at 0.9 KB/sec)
Uploading: https://repository.apache.org/content/repositories/snapshots/org/apache/juneau/juneau-rest/7.2.0-SNAPSHOT/juneau-rest-7.2.0-20180916.214201-17.pom
2/3 KB      3/3 KB            Uploaded: https://repository.apache.org/content/repositories/snapshots/org/apache/juneau/juneau-rest/7.2.0-SNAPSHOT/juneau-rest-7.2.0-20180916.214201-17.pom
(3 KB at 2.3 KB/sec)
Downloading: https://repository.apache.org/content/repositories/snapshots/org/apache/juneau/juneau-rest/maven-metadata.xml
683/683 B               Downloaded: https://repository.apache.org/content/repositories/snapshots/org/apache/juneau/juneau-rest/maven-metadata.xml
(683 B at 1.1 KB/sec)
Uploading: https://repository.apache.org/content/repositories/snapshots/org/apache/juneau/juneau-rest/7.2.0-SNAPSHOT/maven-metadata.xml
607/607 B               Uploaded: https://repository.apache.org/content/repositories/snapshots/org/apache/juneau/juneau-rest/7.2.0-SNAPSHOT/maven-metadata.xml
(607 B at 0.5 KB/sec)
Uploading: https://repository.apache.org/content/repositories/snapshots/org/apache/juneau/juneau-rest/maven-metadata.xml
683/683 B               Uploaded: https://repository.apache.org/content/repositories/snapshots/org/apache/juneau/juneau-rest/maven-metadata.xml
(683 B at 0.7 KB/sec)
[INFO]                                                                         
[INFO] ------------------------------------------------------------------------
[INFO] Building Apache Juneau REST Servlet API 7.2.0-SNAPSHOT
[INFO] ------------------------------------------------------------------------
[INFO] 
[INFO] --- maven-clean-plugin:3.0.0:clean (default-clean) @ juneau-rest-server ---
[INFO] Deleting <https://builds.apache.org/job/Juneau-Java-1.8/ws/juneau-rest/juneau-rest-server/target>
[INFO] 
[INFO] --- maven-enforcer-plugin:1.4.1:enforce (enforce-maven) @ juneau-rest-server ---
[INFO] 
[INFO] --- maven-remote-resources-plugin:1.5:process (process-resource-bundles) @ juneau-rest-server
---
[INFO] 
[INFO] --- maven-resources-plugin:2.7:resources (default-resources) @ juneau-rest-server ---
[INFO] Using 'UTF-8' encoding to copy filtered resources.
[INFO] Copying 9 resources
[INFO] Copying 3 resources
[INFO] 
[INFO] --- maven-compiler-plugin:3.5.1:compile (default-compile) @ juneau-rest-server ---
[INFO] Changes detected - recompiling the module!
[INFO] Compiling 174 source files to <https://builds.apache.org/job/Juneau-Java-1.8/ws/juneau-rest/juneau-rest-server/target/classes>
[INFO] <https://builds.apache.org/job/Juneau-Java-1.8/ws/juneau-rest/juneau-rest-server/src/main/java/org/apache/juneau/rest/mock/MockServletRequest.java>:
Some input files use or override a deprecated API.
[INFO] <https://builds.apache.org/job/Juneau-Java-1.8/ws/juneau-rest/juneau-rest-server/src/main/java/org/apache/juneau/rest/mock/MockServletRequest.java>:
Recompile with -Xlint:deprecation for details.
[INFO] <https://builds.apache.org/job/Juneau-Java-1.8/ws/juneau-rest/juneau-rest-server/src/main/java/org/apache/juneau/rest/mock/MockServletResponse.java>:
<https://builds.apache.org/job/Juneau-Java-1.8/ws/juneau-rest/juneau-rest-server/src/main/java/org/apache/juneau/rest/mock/MockServletResponse.java>
uses unchecked or unsafe operations.
[INFO] <https://builds.apache.org/job/Juneau-Java-1.8/ws/juneau-rest/juneau-rest-server/src/main/java/org/apache/juneau/rest/mock/MockServletResponse.java>:
Recompile with -Xlint:unchecked for details.
[INFO] 
[INFO] --- maven-resources-plugin:2.7:testResources (default-testResources) @ juneau-rest-server
---
[INFO] Using 'UTF-8' encoding to copy filtered resources.
[INFO] Copying 9 resources
[INFO] Copying 3 resources
[INFO] 
[INFO] --- maven-compiler-plugin:3.5.1:testCompile (default-testCompile) @ juneau-rest-server
---
[INFO] Changes detected - recompiling the module!
[INFO] Compiling 63 source files to <https://builds.apache.org/job/Juneau-Java-1.8/ws/juneau-rest/juneau-rest-server/target/test-classes>
[INFO] 
[INFO] --- maven-surefire-plugin:2.19.1:test (default-test) @ juneau-rest-server ---

-------------------------------------------------------
 T E S T S
-------------------------------------------------------
Running org.apache.juneau.rest.util.UrlPathPatternTest
Tests run: 1, Failures: 0, Errors: 0, Skipped: 0, Time elapsed: 0.194 sec - in org.apache.juneau.rest.util.UrlPathPatternTest
Running org.apache.juneau.rest.util.RestUtilsTest
Tests run: 9, Failures: 0, Errors: 0, Skipped: 0, Time elapsed: 0.063 sec - in org.apache.juneau.rest.util.RestUtilsTest
Running org.apache.juneau.rest.response.BasicTest
Tests run: 71, Failures: 0, Errors: 0, Skipped: 0, Time elapsed: 0.514 sec - in org.apache.juneau.rest.response.BasicTest
Running org.apache.juneau.rest.exception.BasicTest
Tests run: 166, Failures: 0, Errors: 0, Skipped: 0, Time elapsed: 0.253 sec - in org.apache.juneau.rest.exception.BasicTest
Running org.apache.juneau.rest.headers.AcceptEncodingTest
Tests run: 12, Failures: 0, Errors: 0, Skipped: 0, Time elapsed: 0.051 sec - in org.apache.juneau.rest.headers.AcceptEncodingTest
Running org.apache.juneau.rest.headers.AcceptCharsetTest
Tests run: 2, Failures: 0, Errors: 0, Skipped: 0, Time elapsed: 0.041 sec - in org.apache.juneau.rest.headers.AcceptCharsetTest
Running org.apache.juneau.rest.headers.ContentTypeTest
Tests run: 9, Failures: 0, Errors: 0, Skipped: 0, Time elapsed: 0.042 sec - in org.apache.juneau.rest.headers.ContentTypeTest
Running org.apache.juneau.rest.headers.ClientVersionTest
Tests run: 2, Failures: 0, Errors: 0, Skipped: 0, Time elapsed: 0.021 sec - in org.apache.juneau.rest.headers.ClientVersionTest
Running org.apache.juneau.rest.headers.ContentEncodingTest
Tests run: 4, Failures: 0, Errors: 0, Skipped: 0, Time elapsed: 0.017 sec - in org.apache.juneau.rest.headers.ContentEncodingTest
Running org.apache.juneau.rest.headers.HeadersTest
Tests run: 104, Failures: 0, Errors: 0, Skipped: 0, Time elapsed: 1.545 sec - in org.apache.juneau.rest.headers.HeadersTest
Running org.apache.juneau.rest.headers.AcceptTest
Tests run: 11, Failures: 0, Errors: 0, Skipped: 0, Time elapsed: 0.035 sec - in org.apache.juneau.rest.headers.AcceptTest
Running org.apache.juneau.rest.mock.MockServletRequestTest
Tests run: 7, Failures: 0, Errors: 0, Skipped: 0, Time elapsed: 0.003 sec - in org.apache.juneau.rest.mock.MockServletRequestTest
Running org.apache.juneau.rest.RestParamsTest
Tests run: 20, Failures: 0, Errors: 0, Skipped: 0, Time elapsed: 0.024 sec - in org.apache.juneau.rest.RestParamsTest
Running org.apache.juneau.rest.BasicRestInfoProviderTest
Tests run: 157, Failures: 1, Errors: 0, Skipped: 0, Time elapsed: 1.256 sec <<< FAILURE!
- in org.apache.juneau.rest.BasicRestInfoProviderTest
p01_bodyWithReadOnlyProperty(org.apache.juneau.rest.BasicRestInfoProviderTest)  Time elapsed:
0.072 sec  <<< FAILURE!
org.junit.ComparisonFailure: 
expected:<{
	f[1: 1,
	f2: 2]
}> but was:<{
	f[2: 2,
	f1: 1]
}>
	at org.apache.juneau.rest.BasicRestInfoProviderTest.p01_bodyWithReadOnlyProperty(BasicRestInfoProviderTest.java:2333)

Running org.apache.juneau.rest.BeanContextPropertiesTest
Tests run: 1, Failures: 0, Errors: 0, Skipped: 0, Time elapsed: 0.027 sec - in org.apache.juneau.rest.BeanContextPropertiesTest
Running org.apache.juneau.rest.StatusCodesTest
Tests run: 13, Failures: 0, Errors: 0, Skipped: 0, Time elapsed: 0.03 sec - in org.apache.juneau.rest.StatusCodesTest
Running org.apache.juneau.rest.NlsTest
Tests run: 4, Failures: 0, Errors: 0, Skipped: 0, Time elapsed: 0.049 sec - in org.apache.juneau.rest.NlsTest
Running org.apache.juneau.rest.PathsTest
Tests run: 36, Failures: 0, Errors: 0, Skipped: 0, Time elapsed: 0.044 sec - in org.apache.juneau.rest.PathsTest
Running org.apache.juneau.rest.annotation.RestResourcePropertiesTest
Tests run: 1, Failures: 0, Errors: 0, Skipped: 0, Time elapsed: 0.006 sec - in org.apache.juneau.rest.annotation.RestResourcePropertiesTest
Running org.apache.juneau.rest.annotation.RestResourceMessagesTest
Tests run: 2, Failures: 0, Errors: 0, Skipped: 0, Time elapsed: 0.009 sec - in org.apache.juneau.rest.annotation.RestResourceMessagesTest
Running org.apache.juneau.rest.annotation.HasFormDataAnnotationTest
Tests run: 1, Failures: 0, Errors: 0, Skipped: 0, Time elapsed: 0.008 sec - in org.apache.juneau.rest.annotation.HasFormDataAnnotationTest
Running org.apache.juneau.rest.annotation.HasQueryAnnotationTest
Tests run: 2, Failures: 0, Errors: 0, Skipped: 0, Time elapsed: 0.01 sec - in org.apache.juneau.rest.annotation.HasQueryAnnotationTest
Running org.apache.juneau.rest.annotation.HeaderAnnotationTest
Tests run: 19, Failures: 0, Errors: 0, Skipped: 0, Time elapsed: 0.043 sec - in org.apache.juneau.rest.annotation.HeaderAnnotationTest
Running org.apache.juneau.rest.annotation.HtmlDocNavTest
Tests run: 10, Failures: 0, Errors: 0, Skipped: 0, Time elapsed: 0.055 sec - in org.apache.juneau.rest.annotation.HtmlDocNavTest
Running org.apache.juneau.rest.annotation.RestResourceSerializersTest
Tests run: 5, Failures: 0, Errors: 0, Skipped: 0, Time elapsed: 0.011 sec - in org.apache.juneau.rest.annotation.RestResourceSerializersTest
Running org.apache.juneau.rest.annotation.HtmlDocScriptTest
Tests run: 10, Failures: 0, Errors: 0, Skipped: 0, Time elapsed: 0.059 sec - in org.apache.juneau.rest.annotation.HtmlDocScriptTest
Running org.apache.juneau.rest.annotation.RestResourceStaticFilesTest
Tests run: 3, Failures: 0, Errors: 0, Skipped: 0, Time elapsed: 0.014 sec - in org.apache.juneau.rest.annotation.RestResourceStaticFilesTest
Running org.apache.juneau.rest.annotation.RestResourceParsersTest
Tests run: 5, Failures: 0, Errors: 0, Skipped: 0, Time elapsed: 0.011 sec - in org.apache.juneau.rest.annotation.RestResourceParsersTest
Running org.apache.juneau.rest.annotation.HtmlDocAsideTest
Tests run: 10, Failures: 0, Errors: 0, Skipped: 0, Time elapsed: 0.06 sec - in org.apache.juneau.rest.annotation.HtmlDocAsideTest
Running org.apache.juneau.rest.annotation.HtmlDocFooterTest
Tests run: 10, Failures: 0, Errors: 0, Skipped: 0, Time elapsed: 0.06 sec - in org.apache.juneau.rest.annotation.HtmlDocFooterTest
Running org.apache.juneau.rest.annotation.BodyAnnotationTest
Tests run: 98, Failures: 0, Errors: 0, Skipped: 0, Time elapsed: 0.194 sec - in org.apache.juneau.rest.annotation.BodyAnnotationTest
Running org.apache.juneau.rest.annotation.HtmlDocStyleTest
Tests run: 10, Failures: 0, Errors: 0, Skipped: 0, Time elapsed: 0.041 sec - in org.apache.juneau.rest.annotation.HtmlDocStyleTest
Running org.apache.juneau.rest.annotation.RestHookTest
Tests run: 14, Failures: 0, Errors: 0, Skipped: 0, Time elapsed: 0.064 sec - in org.apache.juneau.rest.annotation.RestHookTest
Running org.apache.juneau.rest.annotation.RestMethodGuardsTest
Tests run: 2, Failures: 0, Errors: 0, Skipped: 0, Time elapsed: 0.008 sec - in org.apache.juneau.rest.annotation.RestMethodGuardsTest
Running org.apache.juneau.rest.annotation.HtmlDocNavlinksTest
Tests run: 22, Failures: 0, Errors: 0, Skipped: 0, Time elapsed: 0.069 sec - in org.apache.juneau.rest.annotation.HtmlDocNavlinksTest
Running org.apache.juneau.rest.annotation.ResponseStatusAnnotationTest
Tests run: 1, Failures: 0, Errors: 0, Skipped: 0, Time elapsed: 0.004 sec - in org.apache.juneau.rest.annotation.ResponseStatusAnnotationTest
Running org.apache.juneau.rest.annotation.FormDataAnnotationTest
Tests run: 27, Failures: 0, Errors: 0, Skipped: 0, Time elapsed: 0.07 sec - in org.apache.juneau.rest.annotation.FormDataAnnotationTest
Running org.apache.juneau.rest.annotation.PathRemainderAnnotationTest
Tests run: 3, Failures: 0, Errors: 0, Skipped: 0, Time elapsed: 0 sec - in org.apache.juneau.rest.annotation.PathRemainderAnnotationTest
Running org.apache.juneau.rest.annotation.RestResourcePojoSwapsTest
Tests run: 2, Failures: 0, Errors: 0, Skipped: 0, Time elapsed: 0.017 sec - in org.apache.juneau.rest.annotation.RestResourcePojoSwapsTest
Running org.apache.juneau.rest.annotation.RestMethodBpiTest
Tests run: 16, Failures: 0, Errors: 0, Skipped: 0, Time elapsed: 0.213 sec - in org.apache.juneau.rest.annotation.RestMethodBpiTest
Running org.apache.juneau.rest.annotation.HtmlDocHeaderTest
Tests run: 10, Failures: 0, Errors: 0, Skipped: 0, Time elapsed: 0.026 sec - in org.apache.juneau.rest.annotation.HtmlDocHeaderTest
Running org.apache.juneau.rest.annotation.RestMethodInheritTest
Tests run: 13, Failures: 0, Errors: 0, Skipped: 0, Time elapsed: 0.049 sec - in org.apache.juneau.rest.annotation.RestMethodInheritTest
Running org.apache.juneau.rest.annotation.ResponseAnnotationTest
Tests run: 68, Failures: 0, Errors: 0, Skipped: 0, Time elapsed: 0.165 sec - in org.apache.juneau.rest.annotation.ResponseAnnotationTest
Running org.apache.juneau.rest.annotation.PathAnnotationTest
Tests run: 46, Failures: 0, Errors: 0, Skipped: 0, Time elapsed: 0.124 sec - in org.apache.juneau.rest.annotation.PathAnnotationTest
Running org.apache.juneau.rest.annotation.ResponseHeaderAnnotationTest
Tests run: 17, Failures: 0, Errors: 0, Skipped: 0, Time elapsed: 0.033 sec - in org.apache.juneau.rest.annotation.ResponseHeaderAnnotationTest
Running org.apache.juneau.rest.annotation.QueryAnnotationTest
Tests run: 31, Failures: 0, Errors: 0, Skipped: 0, Time elapsed: 0.079 sec - in org.apache.juneau.rest.annotation.QueryAnnotationTest
Running org.apache.juneau.rest.annotation.RestMethodPathTest
Tests run: 1, Failures: 0, Errors: 0, Skipped: 0, Time elapsed: 0.001 sec - in org.apache.juneau.rest.annotation.RestMethodPathTest
Running org.apache.juneau.rest.annotation.RestMethodMatchersTest
Tests run: 2, Failures: 0, Errors: 0, Skipped: 0, Time elapsed: 0.005 sec - in org.apache.juneau.rest.annotation.RestMethodMatchersTest
Running org.apache.juneau.rest.annotation.RestResourcePathTest
Tests run: 1, Failures: 0, Errors: 0, Skipped: 0, Time elapsed: 0.013 sec - in org.apache.juneau.rest.annotation.RestResourcePathTest
Running org.apache.jueau.rest.helper.StreamResourceTest
Tests run: 7, Failures: 0, Errors: 0, Skipped: 0, Time elapsed: 0.009 sec - in org.apache.jueau.rest.helper.StreamResourceTest
Running org.apache.jueau.rest.helper.ReaderResourceTest
Tests run: 7, Failures: 0, Errors: 0, Skipped: 0, Time elapsed: 0.01 sec - in org.apache.jueau.rest.helper.ReaderResourceTest

Results :

Failed tests: 
  BasicRestInfoProviderTest.p01_bodyWithReadOnlyProperty:2333 expected:<{
	f[1: 1,
	f2: 2]
}> but was:<{
	f[2: 2,
	f1: 1]
}>

Tests run: 1105, Failures: 1, Errors: 0, Skipped: 0

[INFO]                                                                         
[INFO] ------------------------------------------------------------------------
[INFO] Skipping Apache Juneau
[INFO] This project has been banned from the build due to previous failures.
[INFO] ------------------------------------------------------------------------
[INFO] ------------------------------------------------------------------------
[INFO] Reactor Summary:
[INFO] 
[INFO] Apache Juneau ...................................... SUCCESS [  9.499 s]
[INFO] Apache Juneau - Core APIs .......................... SUCCESS [  5.493 s]
[INFO] Apache Juneau Marshall ............................. SUCCESS [ 40.268 s]
[INFO] Apache Juneau Marshal RDF .......................... SUCCESS [ 15.503 s]
[INFO] Apache Juneau Data Transfer Objects ................ SUCCESS [ 17.740 s]
[INFO] Apache Juneau Core ................................. SUCCESS [ 13.975 s]
[INFO] Apache Juneau Config File API ...................... SUCCESS [ 13.359 s]
[INFO] Apache Juneau Core Tests ........................... SUCCESS [ 48.369 s]
[INFO] Apache Juneau - REST APIs .......................... SUCCESS [  4.637 s]
[INFO] Apache Juneau REST Servlet API ..................... FAILURE [  8.162 s]
[INFO] Apache Juneau REST JAX/RS API ...................... SKIPPED
[INFO] Apache Juneau REST Client API ...................... SKIPPED
[INFO] Apache Juneau - Microservice APIs .................. SKIPPED
[INFO] Apache Juneau Microservice Server .................. SKIPPED
[INFO] Apache Juneau Microservice Template ................ SKIPPED
[INFO] Apache Juneau - Examples ........................... SKIPPED
[INFO] Apache Juneau REST Examples ........................ SKIPPED
[INFO] Apache Juneau Microservice Tests ................... SKIPPED
[INFO] Apache Juneau Core Examples ........................ SKIPPED
[INFO] Apache Juneau Javadocs ............................. SKIPPED
[INFO] Apache Juneau - Release Engineering ................ SKIPPED
[INFO] Apache Juneau UberJar .............................. SKIPPED
[INFO] Apache Juneau Distribution ......................... SKIPPED
[INFO] ------------------------------------------------------------------------
[INFO] BUILD FAILURE
[INFO] ------------------------------------------------------------------------
[INFO] Total time: 02:58 min
[INFO] Finished at: 2018-09-16T21:42:13+00:00
[INFO] Final Memory: 76M/2705M
[INFO] ------------------------------------------------------------------------
[ERROR] Failed to execute goal org.apache.maven.plugins:maven-surefire-plugin:2.19.1:test
(default-test) on project juneau-rest-server: There are test failures.
[ERROR] 
[ERROR] Please refer to <https://builds.apache.org/job/Juneau-Java-1.8/ws/juneau-rest/juneau-rest-server/target/surefire-reports>
for the individual test results.
[ERROR] -> [Help 1]
[ERROR] 
[ERROR] To see the full stack trace of the errors, re-run Maven with the -e switch.
[ERROR] Re-run Maven using the -X switch to enable full debug logging.
[ERROR] 
[ERROR] For more information about the errors and possible solutions, please read the following
articles:
[ERROR] [Help 1] http://cwiki.apache.org/confluence/display/MAVEN/MojoFailureException
[ERROR] 
[ERROR] After correcting the problems, you can resume the build with the command
[ERROR]   mvn <goals> -rf :juneau-rest-server
Build step 'Invoke top-level Maven targets' marked build as failure
Recording test results
[FINDBUGS] Skipping publisher since build result is FAILURE
[TASKS] Skipping publisher since build result is FAILURE
Publishing Javadoc

Mime
View raw message