juneau-dev mailing list archives

Site index · List index
Message view « Date » · « Thread »
Top « Date » · « Thread »
From Apache Jenkins Server <jenk...@builds.apache.org>
Subject Build failed in Jenkins: Juneau-Java-1.8 #907
Date Wed, 11 Jul 2018 21:59:52 GMT
See <https://builds.apache.org/job/Juneau-Java-1.8/907/display/redirect?page=changes>

Changes:

[JamesBognar] HttpPart API changes (introduce sessions).

------------------------------------------
[...truncated 823 B...]
 > git config --add remote.origin.fetch +refs/heads/*:refs/remotes/origin/* # timeout=10
 > git config remote.origin.url https://github.com/apache/juneau.git # timeout=10
Fetching upstream changes from https://github.com/apache/juneau.git
 > git fetch --tags --progress https://github.com/apache/juneau.git +refs/heads/*:refs/remotes/origin/*
 > git rev-parse refs/remotes/origin/master^{commit} # timeout=10
 > git rev-parse refs/remotes/origin/origin/master^{commit} # timeout=10
Checking out Revision fbbc2934334d7eed648d6063e269769daf91a38b (refs/remotes/origin/master)
 > git config core.sparsecheckout # timeout=10
 > git checkout -f fbbc2934334d7eed648d6063e269769daf91a38b
Commit message: "HttpPart API changes (introduce sessions)."
 > git rev-list --no-walk 35fdd18c9a4f194488acaaa03e343ed6f255d95b # timeout=10
[Juneau-Java-1.8] $ /home/jenkins/tools/maven/apache-maven-3.2.5/bin/mvn clean install deploy
javadoc:aggregate
[INFO] Scanning for projects...
[INFO] ------------------------------------------------------------------------
[INFO] Reactor Build Order:
[INFO] 
[INFO] Apache Juneau
[INFO] Apache Juneau - Core APIs
[INFO] Apache Juneau Marshall
[INFO] Apache Juneau Marshal RDF
[INFO] Apache Juneau Data Transfer Objects
[INFO] Apache Juneau Core
[INFO] Apache Juneau Config File API
[INFO] Apache Juneau Core Tests
[INFO] Apache Juneau - REST APIs
[INFO] Apache Juneau REST Servlet API
[INFO] Apache Juneau REST JAX/RS API
[INFO] Apache Juneau REST Client API
[INFO] Apache Juneau - Microservice APIs
[INFO] Apache Juneau Microservice Server
[INFO] Apache Juneau Microservice Template
[INFO] Apache Juneau - Examples
[INFO] Apache Juneau REST Examples
[INFO] Apache Juneau Microservice Tests
[INFO] Apache Juneau Core Examples
[INFO] Apache Juneau Javadocs
[INFO] Apache Juneau - Release Engineering
[INFO] Apache Juneau UberJar
[INFO] Apache Juneau Distribution
[INFO]                                                                         
[INFO] ------------------------------------------------------------------------
[INFO] Building Apache Juneau 7.1.1-SNAPSHOT
[INFO] ------------------------------------------------------------------------
[INFO] 
[INFO] --- maven-clean-plugin:3.0.0:clean (default-clean) @ juneau ---
[INFO] 
[INFO] --- maven-enforcer-plugin:1.4.1:enforce (enforce-maven) @ juneau ---
[INFO] 
[INFO] --- maven-remote-resources-plugin:1.5:process (process-resource-bundles) @ juneau ---
[INFO] 
[INFO] --- maven-site-plugin:3.5.1:attach-descriptor (attach-descriptor) @ juneau ---
[INFO] 
[INFO] --- apache-rat-plugin:0.11:check (default) @ juneau ---
[INFO] 57 implicit excludes (use -debug for more details).
[INFO] Exclude: **/DEPENDENCIES
[INFO] Exclude: **/target/**
[INFO] Exclude: **/.settings/**
[INFO] Exclude: **/.project
[INFO] Exclude: **/.classpath
[INFO] Exclude: **/*.launch
[INFO] Exclude: **/jetty.out.xml
[INFO] Exclude: **/dependency-reduced-pom.xml
[INFO] 12 resources included (use -debug for more details)
[INFO] Rat check: Summary of files. Unapproved: 0 unknown: 0 generated: 0 approved: 9 licence.
[INFO] 
[INFO] --- maven-install-plugin:2.5.2:install (default-install) @ juneau ---
[INFO] Installing <https://builds.apache.org/job/Juneau-Java-1.8/ws/pom.xml> to /home/jenkins/.m2/repository/org/apache/juneau/juneau/7.1.1-SNAPSHOT/juneau-7.1.1-SNAPSHOT.pom
[INFO] 
[INFO] --- maven-enforcer-plugin:1.4.1:enforce (enforce-maven) @ juneau ---
[INFO] 
[INFO] --- maven-remote-resources-plugin:1.5:process (process-resource-bundles) @ juneau ---
[INFO] 
[INFO] --- maven-site-plugin:3.5.1:attach-descriptor (attach-descriptor) @ juneau ---
[INFO] 
[INFO] --- apache-rat-plugin:0.11:check (default) @ juneau ---
[INFO] 57 implicit excludes (use -debug for more details).
[INFO] Exclude: **/DEPENDENCIES
[INFO] Exclude: **/target/**
[INFO] Exclude: **/.settings/**
[INFO] Exclude: **/.project
[INFO] Exclude: **/.classpath
[INFO] Exclude: **/*.launch
[INFO] Exclude: **/jetty.out.xml
[INFO] Exclude: **/dependency-reduced-pom.xml
[INFO] 12 resources included (use -debug for more details)
[INFO] Rat check: Summary of files. Unapproved: 0 unknown: 0 generated: 0 approved: 9 licence.
[INFO] 
[INFO] --- maven-install-plugin:2.5.2:install (default-install) @ juneau ---
[INFO] Installing <https://builds.apache.org/job/Juneau-Java-1.8/ws/pom.xml> to /home/jenkins/.m2/repository/org/apache/juneau/juneau/7.1.1-SNAPSHOT/juneau-7.1.1-SNAPSHOT.pom
[INFO] 
[INFO] --- maven-deploy-plugin:2.8.2:deploy (default-deploy) @ juneau ---
Downloading: https://repository.apache.org/content/repositories/snapshots/org/apache/juneau/juneau/7.1.1-SNAPSHOT/maven-metadata.xml
604/604 B               Downloaded: https://repository.apache.org/content/repositories/snapshots/org/apache/juneau/juneau/7.1.1-SNAPSHOT/maven-metadata.xml
(604 B at 0.6 KB/sec)
Uploading: https://repository.apache.org/content/repositories/snapshots/org/apache/juneau/juneau/7.1.1-SNAPSHOT/juneau-7.1.1-20180711.215935-196.pom
2/12 KB     4/12 KB   6/12 KB   8/12 KB   10/12 KB   12/12 KB              Uploaded: https://repository.apache.org/content/repositories/snapshots/org/apache/juneau/juneau/7.1.1-SNAPSHOT/juneau-7.1.1-20180711.215935-196.pom
(12 KB at 10.8 KB/sec)
Downloading: https://repository.apache.org/content/repositories/snapshots/org/apache/juneau/juneau/maven-metadata.xml
638/638 B               Downloaded: https://repository.apache.org/content/repositories/snapshots/org/apache/juneau/juneau/maven-metadata.xml
(638 B at 0.9 KB/sec)
Uploading: https://repository.apache.org/content/repositories/snapshots/org/apache/juneau/juneau/7.1.1-SNAPSHOT/maven-metadata.xml
604/604 B               Uploaded: https://repository.apache.org/content/repositories/snapshots/org/apache/juneau/juneau/7.1.1-SNAPSHOT/maven-metadata.xml
(604 B at 0.6 KB/sec)
Uploading: https://repository.apache.org/content/repositories/snapshots/org/apache/juneau/juneau/maven-metadata.xml
638/638 B               Uploaded: https://repository.apache.org/content/repositories/snapshots/org/apache/juneau/juneau/maven-metadata.xml
(638 B at 0.6 KB/sec)
[INFO]                                                                         
[INFO] ------------------------------------------------------------------------
[INFO] Building Apache Juneau - Core APIs 7.1.1-SNAPSHOT
[INFO] ------------------------------------------------------------------------
[INFO] 
[INFO] --- maven-clean-plugin:3.0.0:clean (default-clean) @ juneau-core ---
[INFO] 
[INFO] --- maven-enforcer-plugin:1.4.1:enforce (enforce-maven) @ juneau-core ---
[INFO] 
[INFO] --- maven-remote-resources-plugin:1.5:process (process-resource-bundles) @ juneau-core
---
[INFO] 
[INFO] --- maven-site-plugin:3.5.1:attach-descriptor (attach-descriptor) @ juneau-core ---
[INFO] 
[INFO] --- apache-rat-plugin:0.11:check (default) @ juneau-core ---
[INFO] 57 implicit excludes (use -debug for more details).
[INFO] Exclude: **/DEPENDENCIES
[INFO] Exclude: **/target/**
[INFO] Exclude: **/.settings/**
[INFO] Exclude: **/.project
[INFO] Exclude: **/.classpath
[INFO] Exclude: **/*.launch
[INFO] Exclude: **/jetty.out.xml
[INFO] Exclude: **/dependency-reduced-pom.xml
[INFO] 1 resources included (use -debug for more details)
[INFO] Rat check: Summary of files. Unapproved: 0 unknown: 0 generated: 0 approved: 1 licence.
[INFO] 
[INFO] --- maven-install-plugin:2.5.2:install (default-install) @ juneau-core ---
[INFO] Installing <https://builds.apache.org/job/Juneau-Java-1.8/ws/juneau-core/pom.xml>
to /home/jenkins/.m2/repository/org/apache/juneau/juneau-core/7.1.1-SNAPSHOT/juneau-core-7.1.1-SNAPSHOT.pom
[INFO] 
[INFO] --- maven-enforcer-plugin:1.4.1:enforce (enforce-maven) @ juneau-core ---
[INFO] 
[INFO] --- maven-remote-resources-plugin:1.5:process (process-resource-bundles) @ juneau-core
---
[INFO] 
[INFO] --- maven-site-plugin:3.5.1:attach-descriptor (attach-descriptor) @ juneau-core ---
[INFO] 
[INFO] --- apache-rat-plugin:0.11:check (default) @ juneau-core ---
[INFO] 57 implicit excludes (use -debug for more details).
[INFO] Exclude: **/DEPENDENCIES
[INFO] Exclude: **/target/**
[INFO] Exclude: **/.settings/**
[INFO] Exclude: **/.project
[INFO] Exclude: **/.classpath
[INFO] Exclude: **/*.launch
[INFO] Exclude: **/jetty.out.xml
[INFO] Exclude: **/dependency-reduced-pom.xml
[INFO] 1 resources included (use -debug for more details)
[INFO] Rat check: Summary of files. Unapproved: 0 unknown: 0 generated: 0 approved: 1 licence.
[INFO] 
[INFO] --- maven-install-plugin:2.5.2:install (default-install) @ juneau-core ---
[INFO] Installing <https://builds.apache.org/job/Juneau-Java-1.8/ws/juneau-core/pom.xml>
to /home/jenkins/.m2/repository/org/apache/juneau/juneau-core/7.1.1-SNAPSHOT/juneau-core-7.1.1-SNAPSHOT.pom
[INFO] 
[INFO] --- maven-deploy-plugin:2.8.2:deploy (default-deploy) @ juneau-core ---
Downloading: https://repository.apache.org/content/repositories/snapshots/org/apache/juneau/juneau-core/7.1.1-SNAPSHOT/maven-metadata.xml
609/609 B               Downloaded: https://repository.apache.org/content/repositories/snapshots/org/apache/juneau/juneau-core/7.1.1-SNAPSHOT/maven-metadata.xml
(609 B at 0.9 KB/sec)
Uploading: https://repository.apache.org/content/repositories/snapshots/org/apache/juneau/juneau-core/7.1.1-SNAPSHOT/juneau-core-7.1.1-20180711.215940-196.pom
2/3 KB      3/3 KB            Uploaded: https://repository.apache.org/content/repositories/snapshots/org/apache/juneau/juneau-core/7.1.1-SNAPSHOT/juneau-core-7.1.1-20180711.215940-196.pom
(3 KB at 2.3 KB/sec)
Downloading: https://repository.apache.org/content/repositories/snapshots/org/apache/juneau/juneau-core/maven-metadata.xml
643/643 B               Downloaded: https://repository.apache.org/content/repositories/snapshots/org/apache/juneau/juneau-core/maven-metadata.xml
(643 B at 1.0 KB/sec)
Uploading: https://repository.apache.org/content/repositories/snapshots/org/apache/juneau/juneau-core/7.1.1-SNAPSHOT/maven-metadata.xml
609/609 B               Uploaded: https://repository.apache.org/content/repositories/snapshots/org/apache/juneau/juneau-core/7.1.1-SNAPSHOT/maven-metadata.xml
(609 B at 0.6 KB/sec)
Uploading: https://repository.apache.org/content/repositories/snapshots/org/apache/juneau/juneau-core/maven-metadata.xml
643/643 B               Uploaded: https://repository.apache.org/content/repositories/snapshots/org/apache/juneau/juneau-core/maven-metadata.xml
(643 B at 0.7 KB/sec)
[INFO]                                                                         
[INFO] ------------------------------------------------------------------------
[INFO] Building Apache Juneau Marshall 7.1.1-SNAPSHOT
[INFO] ------------------------------------------------------------------------
[INFO] 
[INFO] --- maven-clean-plugin:3.0.0:clean (default-clean) @ juneau-marshall ---
[INFO] 
[INFO] --- maven-enforcer-plugin:1.4.1:enforce (enforce-maven) @ juneau-marshall ---
[INFO] 
[INFO] --- jacoco-maven-plugin:0.7.2.201409121644:prepare-agent (default-prepare-agent) @
juneau-marshall ---
[INFO] argLine set to -javaagent:/home/jenkins/.m2/repository/org/jacoco/org.jacoco.agent/0.7.2.201409121644/org.jacoco.agent-0.7.2.201409121644-runtime.jar=destfile=<https://builds.apache.org/job/Juneau-Java-1.8/ws/juneau-core/juneau-marshall/target/jacoco.exec>
[INFO] 
[INFO] --- maven-remote-resources-plugin:1.5:process (process-resource-bundles) @ juneau-marshall
---
[INFO] 
[INFO] --- maven-resources-plugin:2.7:resources (default-resources) @ juneau-marshall ---
[INFO] Using 'UTF-8' encoding to copy filtered resources.
[INFO] Copying 1 resource
[INFO] Copying 3 resources
[INFO] 
[INFO] --- maven-compiler-plugin:3.5.1:compile (default-compile) @ juneau-marshall ---
[INFO] Changes detected - recompiling the module!
[INFO] Compiling 470 source files to <https://builds.apache.org/job/Juneau-Java-1.8/ws/juneau-core/juneau-marshall/target/classes>
[INFO] <https://builds.apache.org/job/Juneau-Java-1.8/ws/juneau-core/juneau-marshall/src/main/java/org/apache/juneau/internal/StringUtils.java>:
Some input files use unchecked or unsafe operations.
[INFO] <https://builds.apache.org/job/Juneau-Java-1.8/ws/juneau-core/juneau-marshall/src/main/java/org/apache/juneau/internal/StringUtils.java>:
Recompile with -Xlint:unchecked for details.
[INFO] -------------------------------------------------------------
[ERROR] COMPILATION ERROR : 
[INFO] -------------------------------------------------------------
[ERROR] <https://builds.apache.org/job/Juneau-Java-1.8/ws/juneau-core/juneau-marshall/src/main/java/org/apache/juneau/httppart/OpenApiPartSerializerBuilder.java>:[28,8]
class OpenPartSerializerBuilder is public, should be declared in a file named OpenPartSerializerBuilder.java
[INFO] 1 error
[INFO] -------------------------------------------------------------
[INFO]                                                                         
[INFO] ------------------------------------------------------------------------
[INFO] Skipping Apache Juneau
[INFO] This project has been banned from the build due to previous failures.
[INFO] ------------------------------------------------------------------------
[INFO] ------------------------------------------------------------------------
[INFO] Reactor Summary:
[INFO] 
[INFO] Apache Juneau ...................................... SUCCESS [  8.863 s]
[INFO] Apache Juneau - Core APIs .......................... SUCCESS [  4.466 s]
[INFO] Apache Juneau Marshall ............................. FAILURE [  7.105 s]
[INFO] Apache Juneau Marshal RDF .......................... SKIPPED
[INFO] Apache Juneau Data Transfer Objects ................ SKIPPED
[INFO] Apache Juneau Core ................................. SKIPPED
[INFO] Apache Juneau Config File API ...................... SKIPPED
[INFO] Apache Juneau Core Tests ........................... SKIPPED
[INFO] Apache Juneau - REST APIs .......................... SKIPPED
[INFO] Apache Juneau REST Servlet API ..................... SKIPPED
[INFO] Apache Juneau REST JAX/RS API ...................... SKIPPED
[INFO] Apache Juneau REST Client API ...................... SKIPPED
[INFO] Apache Juneau - Microservice APIs .................. SKIPPED
[INFO] Apache Juneau Microservice Server .................. SKIPPED
[INFO] Apache Juneau Microservice Template ................ SKIPPED
[INFO] Apache Juneau - Examples ........................... SKIPPED
[INFO] Apache Juneau REST Examples ........................ SKIPPED
[INFO] Apache Juneau Microservice Tests ................... SKIPPED
[INFO] Apache Juneau Core Examples ........................ SKIPPED
[INFO] Apache Juneau Javadocs ............................. SKIPPED
[INFO] Apache Juneau - Release Engineering ................ SKIPPED
[INFO] Apache Juneau UberJar .............................. SKIPPED
[INFO] Apache Juneau Distribution ......................... SKIPPED
[INFO] ------------------------------------------------------------------------
[INFO] BUILD FAILURE
[INFO] ------------------------------------------------------------------------
[INFO] Total time: 22.650 s
[INFO] Finished at: 2018-07-11T21:59:51+00:00
[INFO] Final Memory: 42M/1726M
[INFO] ------------------------------------------------------------------------
[ERROR] Failed to execute goal org.apache.maven.plugins:maven-compiler-plugin:3.5.1:compile
(default-compile) on project juneau-marshall: Compilation failure
[ERROR] <https://builds.apache.org/job/Juneau-Java-1.8/ws/juneau-core/juneau-marshall/src/main/java/org/apache/juneau/httppart/OpenApiPartSerializerBuilder.java>:[28,8]
class OpenPartSerializerBuilder is public, should be declared in a file named OpenPartSerializerBuilder.java
[ERROR] -> [Help 1]
[ERROR] 
[ERROR] To see the full stack trace of the errors, re-run Maven with the -e switch.
[ERROR] Re-run Maven using the -X switch to enable full debug logging.
[ERROR] 
[ERROR] For more information about the errors and possible solutions, please read the following
articles:
[ERROR] [Help 1] http://cwiki.apache.org/confluence/display/MAVEN/MojoFailureException
[ERROR] 
[ERROR] After correcting the problems, you can resume the build with the command
[ERROR]   mvn <goals> -rf :juneau-marshall
Build step 'Invoke top-level Maven targets' marked build as failure
Recording test results
ERROR: Step ?Publish JUnit test result report? failed: No test report files were found. Configuration
error?
[FINDBUGS] Skipping publisher since build result is FAILURE
[TASKS] Skipping publisher since build result is FAILURE
Publishing Javadoc

Mime
View raw message