juneau-dev mailing list archives

Site index · List index
Message view « Date » · « Thread »
Top « Date » · « Thread »
From Apache Jenkins Server <jenk...@builds.apache.org>
Subject Build failed in Jenkins: Juneau-Java-1.8 #802
Date Wed, 25 Apr 2018 00:14:14 GMT
See <https://builds.apache.org/job/Juneau-Java-1.8/802/display/redirect?page=changes>

Changes:

[JamesBognar] Minor fix in Config API.

------------------------------------------
[...truncated 166.99 KB...]
Tests run: 1, Failures: 0, Errors: 0, Skipped: 0, Time elapsed: 0 sec - in org.apache.juneau.svl.vars.IfVarTest
Running org.apache.juneau.svl.vars.LowerCaseVarTest
Tests run: 1, Failures: 0, Errors: 0, Skipped: 0, Time elapsed: 0 sec - in org.apache.juneau.svl.vars.LowerCaseVarTest
Running org.apache.juneau.svl.vars.RestrictedVarsTest
Tests run: 3, Failures: 0, Errors: 0, Skipped: 0, Time elapsed: 0 sec - in org.apache.juneau.svl.vars.RestrictedVarsTest
Running org.apache.juneau.svl.vars.NotEmptyVarTest
Tests run: 1, Failures: 0, Errors: 0, Skipped: 0, Time elapsed: 0 sec - in org.apache.juneau.svl.vars.NotEmptyVarTest
Running org.apache.juneau.svl.ResolvingObjectMapTest
Tests run: 4, Failures: 0, Errors: 0, Skipped: 0, Time elapsed: 0 sec - in org.apache.juneau.svl.ResolvingObjectMapTest
Running org.apache.juneau.DynaBeanComboTest
Tests run: 390, Failures: 0, Errors: 0, Skipped: 0, Time elapsed: 0.233 sec - in org.apache.juneau.DynaBeanComboTest
Running org.apache.juneau.encoders.EncoderGroupTest
Tests run: 2, Failures: 0, Errors: 0, Skipped: 0, Time elapsed: 0 sec - in org.apache.juneau.encoders.EncoderGroupTest
Running org.apache.juneau.JacocoDummyTest
Tests run: 1, Failures: 0, Errors: 0, Skipped: 0, Time elapsed: 0.001 sec - in org.apache.juneau.JacocoDummyTest
Running org.apache.juneau.BeanMapTest
Tests run: 36, Failures: 0, Errors: 0, Skipped: 0, Time elapsed: 0.082 sec - in org.apache.juneau.BeanMapTest
Running org.apache.juneau.uon.Common_UonTest
Tests run: 8, Failures: 0, Errors: 0, Skipped: 0, Time elapsed: 0.019 sec - in org.apache.juneau.uon.Common_UonTest
Running org.apache.juneau.uon.UonParserTest
Tests run: 5, Failures: 0, Errors: 0, Skipped: 0, Time elapsed: 0.011 sec - in org.apache.juneau.uon.UonParserTest
Running org.apache.juneau.uon.UonParserReaderTest
Tests run: 1, Failures: 0, Errors: 0, Skipped: 0, Time elapsed: 0 sec - in org.apache.juneau.uon.UonParserReaderTest
Running org.apache.juneau.uon.CommonParser_UonTest
Tests run: 4, Failures: 0, Errors: 0, Skipped: 0, Time elapsed: 0.004 sec - in org.apache.juneau.uon.CommonParser_UonTest
Running org.apache.juneau.uon.UonSerializerTest
Tests run: 2, Failures: 0, Errors: 0, Skipped: 0, Time elapsed: 0.006 sec - in org.apache.juneau.uon.UonSerializerTest
Running org.apache.juneau.ObjectMapTest
Tests run: 8, Failures: 0, Errors: 0, Skipped: 0, Time elapsed: 0.01 sec - in org.apache.juneau.ObjectMapTest
Running org.apache.juneau.ContextCacheTest
Tests run: 2, Failures: 0, Errors: 0, Skipped: 0, Time elapsed: 0.006 sec - in org.apache.juneau.ContextCacheTest
Running org.apache.juneau.ParserGenericsTest
Tests run: 2, Failures: 0, Errors: 0, Skipped: 0, Time elapsed: 0.002 sec - in org.apache.juneau.ParserGenericsTest
Running org.apache.juneau.PojoSwapTest
Tests run: 1, Failures: 0, Errors: 0, Skipped: 0, Time elapsed: 0.002 sec - in org.apache.juneau.PojoSwapTest
Running org.apache.juneau.config.ConfigInterfaceTest
Tests run: 47, Failures: 0, Errors: 0, Skipped: 0, Time elapsed: 0.111 sec - in org.apache.juneau.config.ConfigInterfaceTest
Running org.apache.juneau.config.store.MemoryStoreTest
Tests run: 4, Failures: 0, Errors: 0, Skipped: 0, Time elapsed: 0.001 sec - in org.apache.juneau.config.store.MemoryStoreTest
Running org.apache.juneau.config.store.FileStoreTest
Tests run: 7, Failures: 0, Errors: 0, Skipped: 0, Time elapsed: 0.047 sec - in org.apache.juneau.config.store.FileStoreTest
Running org.apache.juneau.config.ConfigMapListenerTest
Tests run: 15, Failures: 0, Errors: 0, Skipped: 0, Time elapsed: 0.023 sec - in org.apache.juneau.config.ConfigMapListenerTest
Running org.apache.juneau.config.ConfigBuilderTest
Tests run: 1, Failures: 0, Errors: 0, Skipped: 0, Time elapsed: 0.005 sec - in org.apache.juneau.config.ConfigBuilderTest
Running org.apache.juneau.config.ConfigTest
Tests run: 60, Failures: 0, Errors: 0, Skipped: 0, Time elapsed: 0.115 sec - in org.apache.juneau.config.ConfigTest
Running org.apache.juneau.config.ConfigMapTest
Tests run: 56, Failures: 1, Errors: 0, Skipped: 0, Time elapsed: 0.068 sec <<< FAILURE!
- in org.apache.juneau.config.ConfigMapTest
testMalformedSectionHeaders(org.apache.juneau.config.ConfigMapTest)  Time elapsed: 0.026 sec
 <<< FAILURE!
java.lang.AssertionError
	at org.apache.juneau.config.ConfigMapTest.testMalformedSectionHeaders(ConfigMapTest.java:276)

Running org.apache.juneau.a.rttests.RoundTripSimpleObjectsTest
Tests run: 1188, Failures: 0, Errors: 0, Skipped: 0, Time elapsed: 1.779 sec - in org.apache.juneau.a.rttests.RoundTripSimpleObjectsTest
Running org.apache.juneau.a.rttests.RoundTripAddClassAttrsTest
Tests run: 70, Failures: 0, Errors: 0, Skipped: 0, Time elapsed: 0.185 sec - in org.apache.juneau.a.rttests.RoundTripAddClassAttrsTest
Running org.apache.juneau.a.rttests.RoundTripDTOsTest
Tests run: 44, Failures: 0, Errors: 0, Skipped: 0, Time elapsed: 0.527 sec - in org.apache.juneau.a.rttests.RoundTripDTOsTest
Running org.apache.juneau.a.rttests.RoundTripToObjectMapsTest
Tests run: 22, Failures: 0, Errors: 0, Skipped: 0, Time elapsed: 0.059 sec - in org.apache.juneau.a.rttests.RoundTripToObjectMapsTest
Running org.apache.juneau.a.rttests.RoundTripPrimitivesBeansTest
Tests run: 44, Failures: 0, Errors: 0, Skipped: 0, Time elapsed: 0.493 sec - in org.apache.juneau.a.rttests.RoundTripPrimitivesBeansTest
Running org.apache.juneau.a.rttests.RoundTripTransformBeansTest
Tests run: 154, Failures: 0, Errors: 0, Skipped: 0, Time elapsed: 0.283 sec - in org.apache.juneau.a.rttests.RoundTripTransformBeansTest
Running org.apache.juneau.a.rttests.RoundTripObjectsWithSpecialMethodsTest
Tests run: 44, Failures: 0, Errors: 0, Skipped: 0, Time elapsed: 0.065 sec - in org.apache.juneau.a.rttests.RoundTripObjectsWithSpecialMethodsTest
Running org.apache.juneau.a.rttests.RoundTripTrimStringsTest
Tests run: 22, Failures: 0, Errors: 0, Skipped: 0, Time elapsed: 0.12 sec - in org.apache.juneau.a.rttests.RoundTripTrimStringsTest
Running org.apache.juneau.a.rttests.RoundTripMapsTest
Tests run: 132, Failures: 0, Errors: 0, Skipped: 0, Time elapsed: 0.196 sec - in org.apache.juneau.a.rttests.RoundTripMapsTest
Running org.apache.juneau.a.rttests.RoundTripClassesTest
Tests run: 22, Failures: 0, Errors: 0, Skipped: 0, Time elapsed: 0.069 sec - in org.apache.juneau.a.rttests.RoundTripClassesTest
Running org.apache.juneau.a.rttests.RoundTripBeanMapsTest
Tests run: 484, Failures: 0, Errors: 0, Skipped: 0, Time elapsed: 0.702 sec - in org.apache.juneau.a.rttests.RoundTripBeanMapsTest
Running org.apache.juneau.a.rttests.RoundTripPrimitiveObjectBeansTest
Tests run: 44, Failures: 0, Errors: 0, Skipped: 0, Time elapsed: 0.52 sec - in org.apache.juneau.a.rttests.RoundTripPrimitiveObjectBeansTest
Running org.apache.juneau.a.rttests.RoundTripObjectsAsStringsTest
Tests run: 66, Failures: 0, Errors: 0, Skipped: 0, Time elapsed: 0.068 sec - in org.apache.juneau.a.rttests.RoundTripObjectsAsStringsTest
Running org.apache.juneau.a.rttests.RoundTripLargeObjectsTest
Tests run: 1, Failures: 0, Errors: 0, Skipped: 1, Time elapsed: 0 sec - in org.apache.juneau.a.rttests.RoundTripLargeObjectsTest
Running org.apache.juneau.a.rttests.RoundTripNumericConstructorsTest
Tests run: 22, Failures: 0, Errors: 0, Skipped: 0, Time elapsed: 0.012 sec - in org.apache.juneau.a.rttests.RoundTripNumericConstructorsTest
Running org.apache.juneau.a.rttests.RoundTripReadOnlyBeansTest
Tests run: 22, Failures: 0, Errors: 0, Skipped: 0, Time elapsed: 0.022 sec - in org.apache.juneau.a.rttests.RoundTripReadOnlyBeansTest
Running org.apache.juneau.a.rttests.RoundTripGenericsTest
Tests run: 22, Failures: 0, Errors: 0, Skipped: 0, Time elapsed: 0.033 sec - in org.apache.juneau.a.rttests.RoundTripGenericsTest
Running org.apache.juneau.a.rttests.RoundTripBeanInheritanceTest
Tests run: 44, Failures: 0, Errors: 0, Skipped: 0, Time elapsed: 0.052 sec - in org.apache.juneau.a.rttests.RoundTripBeanInheritanceTest
Running org.apache.juneau.a.rttests.RoundTripEnumTest
Tests run: 176, Failures: 0, Errors: 0, Skipped: 0, Time elapsed: 0.185 sec - in org.apache.juneau.a.rttests.RoundTripEnumTest
Running org.apache.juneau.VisibilityTest
Tests run: 1, Failures: 0, Errors: 0, Skipped: 0, Time elapsed: 0.05 sec - in org.apache.juneau.VisibilityTest
Running org.apache.juneau.yaml.proto.YamlParserTest
Tests run: 1, Failures: 0, Errors: 0, Skipped: 1, Time elapsed: 0 sec - in org.apache.juneau.yaml.proto.YamlParserTest
Running org.apache.juneau.yaml.proto.YamlTest
Tests run: 1, Failures: 0, Errors: 0, Skipped: 0, Time elapsed: 0 sec - in org.apache.juneau.yaml.proto.YamlTest
Running org.apache.juneau.yaml.proto.CommonParserTest
Tests run: 4, Failures: 0, Errors: 0, Skipped: 0, Time elapsed: 0.029 sec - in org.apache.juneau.yaml.proto.CommonParserTest
Running org.apache.juneau.yaml.proto.CommonTest
Tests run: 1, Failures: 0, Errors: 0, Skipped: 1, Time elapsed: 0 sec - in org.apache.juneau.yaml.proto.CommonTest
Running org.apache.juneau.ParserReaderTest
Tests run: 5, Failures: 0, Errors: 0, Skipped: 0, Time elapsed: 0 sec - in org.apache.juneau.ParserReaderTest
Running org.apache.juneau.xml.XmlContentTest
Tests run: 2, Failures: 0, Errors: 0, Skipped: 0, Time elapsed: 0.018 sec - in org.apache.juneau.xml.XmlContentTest
Running org.apache.juneau.xml.XmlIgnoreCommentsTest
Tests run: 248, Failures: 0, Errors: 0, Skipped: 0, Time elapsed: 0.177 sec - in org.apache.juneau.xml.XmlIgnoreCommentsTest
Running org.apache.juneau.xml.BasicXmlTest
Tests run: 384, Failures: 0, Errors: 0, Skipped: 0, Time elapsed: 0.198 sec - in org.apache.juneau.xml.BasicXmlTest
Running org.apache.juneau.xml.XmlTest
Tests run: 27, Failures: 0, Errors: 0, Skipped: 0, Time elapsed: 0.261 sec - in org.apache.juneau.xml.XmlTest
Running org.apache.juneau.xml.CommonParserTest
Tests run: 4, Failures: 0, Errors: 0, Skipped: 0, Time elapsed: 0.009 sec - in org.apache.juneau.xml.CommonParserTest
Running org.apache.juneau.xml.CommonTest
Tests run: 8, Failures: 0, Errors: 0, Skipped: 0, Time elapsed: 0.039 sec - in org.apache.juneau.xml.CommonTest
Running org.apache.juneau.xml.XmlParserTest
Tests run: 3, Failures: 0, Errors: 0, Skipped: 0, Time elapsed: 0.006 sec - in org.apache.juneau.xml.XmlParserTest
Running org.apache.juneau.xml.CommonXmlTest
Tests run: 2, Failures: 0, Errors: 0, Skipped: 0, Time elapsed: 0.009 sec - in org.apache.juneau.xml.CommonXmlTest
Running org.apache.juneau.xml.XmlCollapsedTest
Tests run: 9, Failures: 0, Errors: 0, Skipped: 0, Time elapsed: 0.069 sec - in org.apache.juneau.xml.XmlCollapsedTest
Running org.apache.juneau.xml.InvalidXmlBeansTest
Tests run: 15, Failures: 0, Errors: 0, Skipped: 0, Time elapsed: 0.016 sec - in org.apache.juneau.xml.InvalidXmlBeansTest
Running org.apache.juneau.PropertyStoreTest
Tests run: 64, Failures: 0, Errors: 0, Skipped: 0, Time elapsed: 0.055 sec - in org.apache.juneau.PropertyStoreTest
Running org.apache.juneau.AnnotationsTest
Tests run: 2, Failures: 0, Errors: 0, Skipped: 0, Time elapsed: 0 sec - in org.apache.juneau.AnnotationsTest
Running org.apache.juneau.ObjectListTest
Tests run: 6, Failures: 0, Errors: 0, Skipped: 0, Time elapsed: 0.003 sec - in org.apache.juneau.ObjectListTest
Running org.apache.juneau.BeanFilterTest
Tests run: 3, Failures: 0, Errors: 0, Skipped: 0, Time elapsed: 0.009 sec - in org.apache.juneau.BeanFilterTest
Running org.apache.juneau.urlencoding.UrlEncodingSerializerTest
Tests run: 6, Failures: 0, Errors: 0, Skipped: 0, Time elapsed: 0.017 sec - in org.apache.juneau.urlencoding.UrlEncodingSerializerTest
Running org.apache.juneau.urlencoding.UrlEncodingParserTest
Tests run: 9, Failures: 0, Errors: 0, Skipped: 0, Time elapsed: 0.022 sec - in org.apache.juneau.urlencoding.UrlEncodingParserTest
Running org.apache.juneau.urlencoding.CommonParser_UrlEncodingTest
Tests run: 5, Failures: 0, Errors: 0, Skipped: 0, Time elapsed: 0.044 sec - in org.apache.juneau.urlencoding.CommonParser_UrlEncodingTest
Running org.apache.juneau.urlencoding.Common_UrlEncodingTest
Tests run: 8, Failures: 0, Errors: 0, Skipped: 0, Time elapsed: 0.024 sec - in org.apache.juneau.urlencoding.Common_UrlEncodingTest
Running org.apache.juneau.PropertyNamerTest
Tests run: 2, Failures: 0, Errors: 0, Skipped: 0, Time elapsed: 0.001 sec - in org.apache.juneau.PropertyNamerTest
Running org.apache.juneau.ClassMetaTest
Tests run: 7, Failures: 0, Errors: 0, Skipped: 0, Time elapsed: 0.011 sec - in org.apache.juneau.ClassMetaTest
Running org.apache.juneau.DataConversionTest
Tests run: 2, Failures: 0, Errors: 0, Skipped: 0, Time elapsed: 0.005 sec - in org.apache.juneau.DataConversionTest
Running org.apache.juneau.httppart.UonPartParserTest
Tests run: 4, Failures: 0, Errors: 0, Skipped: 0, Time elapsed: 0.01 sec - in org.apache.juneau.httppart.UonPartParserTest
[A] = [3,5,62%]
[YamlParser] = [3,0,0%]
[SB2] = [1,0,0%]
[JsonSchemaSerializer] = [54,154,74%]
[B] = [3,3,50%]
[SB1] = [1,0,0%]
[C] = [4,2,33%]
[SB4] = [1,0,0%]
[SB3] = [1,0,0%]
[Config] = [5,113,95%]
[SB5] = [1,0,0%]
[UrlEncodingSerializer] = [151,31968,99%]
[JsonSerializer] = [200,32376,99%]
[UrlEncodingParser] = [65,10846,99%]
[MsgPackSerializer] = [82,21604,99%]
[UonSerializer] = [145,31976,99%]
[JsonParser] = [95,11000,99%]
[SC1] = [1,0,0%]
[Parser3] = [1,0,0%]
[XmlParser] = [47,11015,99%]
[P1] = [1,0,0%]
[SA1] = [1,0,0%]
[SC3] = [1,0,0%]
[P2] = [1,0,0%]
[SC2] = [1,0,0%]
[MsgPackParser] = [46,10599,99%]
[P3] = [1,0,0%]
[SA3] = [1,0,0%]
[P4] = [1,0,0%]
[SA2] = [1,0,0%]
[P5] = [1,0,0%]
[Parser1] = [1,0,0%]
[Parser2] = [1,0,0%]
[PlainTextSerializer] = [1,0,0%]
[UonParser] = [66,10852,99%]
[XmlSchemaSerializer] = [14,0,0%]
[HtmlSchemaDocSerializer] = [2,0,0%]
[D1] = [1,0,0%]
[D2] = [1,0,0%]
[RdfSerializer] = [182,32896,99%]
[HtmlParser] = [47,10859,99%]
[BeanContext] = [248,273,52%]
[YamlSerializer] = [1,0,0%]
[HtmlSerializer] = [158,31973,99%]
[XmlSerializer] = [179,42514,99%]
[RdfParser] = [97,11071,99%]
[total] = [1919,302099,99%]

Results :

Failed tests: 
  ConfigMapTest.testMalformedSectionHeaders:276

Tests run: 18146, Failures: 1, Errors: 0, Skipped: 4

[INFO] ------------------------------------------------------------------------
[INFO] Reactor Summary:
[INFO] 
[INFO] Apache Juneau ...................................... SUCCESS [  7.851 s]
[INFO] Apache Juneau - Core APIs .......................... SUCCESS [  3.180 s]
[INFO] Apache Juneau Marshall ............................. SUCCESS [ 30.123 s]
[INFO] Apache Juneau Marshal RDF .......................... SUCCESS [ 12.021 s]
[INFO] Apache Juneau Data Transfer Objects ................ SUCCESS [ 12.867 s]
[INFO] Apache Juneau Core ................................. SUCCESS [  8.830 s]
[INFO] Apache Juneau Config File API ...................... SUCCESS [  9.938 s]
[INFO] Apache Juneau Core Tests ........................... FAILURE [ 31.236 s]
[INFO] Apache Juneau - REST APIs .......................... SKIPPED
[INFO] Apache Juneau REST Servlet API ..................... SKIPPED
[INFO] Apache Juneau REST JAX/RS API ...................... SKIPPED
[INFO] Apache Juneau REST Client API ...................... SKIPPED
[INFO] Apache Juneau - Microservice APIs .................. SKIPPED
[INFO] Apache Juneau Microservice Server .................. SKIPPED
[INFO] Apache Juneau Microservice Template ................ SKIPPED
[INFO] Apache Juneau - Examples ........................... SKIPPED
[INFO] Apache Juneau REST Examples ........................ SKIPPED
[INFO] Apache Juneau Microservice Tests ................... SKIPPED
[INFO] Apache Juneau Core Examples ........................ SKIPPED
[INFO] Apache Juneau Javadocs ............................. SKIPPED
[INFO] Apache Juneau - Release Engineering ................ SKIPPED
[INFO] Apache Juneau UberJar .............................. SKIPPED
[INFO] Apache Juneau Distribution ......................... SKIPPED
[INFO] ------------------------------------------------------------------------
[INFO] BUILD FAILURE
[INFO] ------------------------------------------------------------------------
[INFO] Total time: 01:57 min
[INFO] Finished at: 2018-04-25T00:14:12+00:00
[INFO] Final Memory: 83M/3116M
[INFO] ------------------------------------------------------------------------
[ERROR] Failed to execute goal org.apache.maven.plugins:maven-surefire-plugin:2.19.1:test
(default-test) on project juneau-core-test: There are test failures.
[ERROR] 
[ERROR] Please refer to <https://builds.apache.org/job/Juneau-Java-1.8/ws/juneau-core/juneau-core-test/target/surefire-reports>
for the individual test results.
[ERROR] -> [Help 1]
[ERROR] 
[ERROR] To see the full stack trace of the errors, re-run Maven with the -e switch.
[ERROR] Re-run Maven using the -X switch to enable full debug logging.
[ERROR] 
[ERROR] For more information about the errors and possible solutions, please read the following
articles:
[ERROR] [Help 1] http://cwiki.apache.org/confluence/display/MAVEN/MojoFailureException
[ERROR] 
[ERROR] After correcting the problems, you can resume the build with the command
[ERROR]   mvn <goals> -rf :juneau-core-test
Build step 'Invoke top-level Maven targets' marked build as failure

Mime
View raw message