juneau-dev mailing list archives

Site index · List index
Message view « Date » · « Thread »
Top « Date » · « Thread »
From Apache Jenkins Server <jenk...@builds.apache.org>
Subject Build failed in Jenkins: Juneau-Java-1.8 #793
Date Sat, 21 Apr 2018 21:31:06 GMT
See <https://builds.apache.org/job/Juneau-Java-1.8/793/display/redirect?page=changes>

Changes:

[JamesBognar] Debug build failure.

------------------------------------------
[...truncated 207.95 KB...]
XXX - TestClasspathResourceFinder.findResource(class org.apache.juneau.rest.BasicRestInfoProviderTest$F02,
BasicRestInfoProvider.json, en)
XXX - InputStream1=null
XXX - TestClasspathResourceFinder.findResource(class org.apache.juneau.rest.BasicRestInfoProviderTest$E02,
BasicRestInfoProvider.json, en)
XXX - InputStream1=null
XXX - TestClasspathResourceFinder.findResource(class org.apache.juneau.rest.BasicRestInfoProviderTest$J09,
BasicRestInfoProvider.json, en)
XXX - InputStream1=null
XXX - TestClasspathResourceFinder.findResource(class org.apache.juneau.rest.BasicRestInfoProviderTest$J01,
BasicRestInfoProvider.json, en)
XXX - InputStream1=null
XXX - TestClasspathResourceFinder.findResource(class org.apache.juneau.rest.BasicRestInfoProviderTest$G01,
BasicRestInfoProvider.json, en)
XXX - InputStream1=null
XXX - TestClasspathResourceFinder.findResource(class org.apache.juneau.rest.BasicRestInfoProviderTest$C06,
BasicRestInfoProvider.json, en)
XXX - InputStream1=null
XXX - TestClasspathResourceFinder.findResource(class org.apache.juneau.rest.BasicRestInfoProviderTest$H01,
BasicRestInfoProvider.json, en)
XXX - InputStream1=null
XXX - TestClasspathResourceFinder.findResource(class org.apache.juneau.rest.BasicRestInfoProviderTest$I01,
BasicRestInfoProvider.json, en)
XXX - InputStream1=null
XXX - TestClasspathResourceFinder.findResource(class org.apache.juneau.rest.BasicRestInfoProviderTest$C02,
BasicRestInfoProvider.json, en)
XXX - InputStream1=null
XXX - TestClasspathResourceFinder.findResource(class org.apache.juneau.rest.BasicRestInfoProviderTest$A02,
BasicRestInfoProvider.json, en)
XXX - InputStream1=null
XXX - TestClasspathResourceFinder.findResource(class org.apache.juneau.rest.BasicRestInfoProviderTest$F05,
BasicRestInfoProvider.json, en)
XXX - InputStream1=null
XXX - TestClasspathResourceFinder.findResource(class org.apache.juneau.rest.BasicRestInfoProviderTest$G03,
BasicRestInfoProvider.json, en)
XXX - InputStream1=null
XXX - TestClasspathResourceFinder.findResource(class org.apache.juneau.rest.BasicRestInfoProviderTest$K02,
BasicRestInfoProvider.json, en)
XXX - InputStream1=null
XXX - TestClasspathResourceFinder.findResource(class org.apache.juneau.rest.BasicRestInfoProviderTest$H02,
BasicRestInfoProvider.json, en)
XXX - InputStream1=null
XXX - TestClasspathResourceFinder.findResource(class org.apache.juneau.rest.BasicRestInfoProviderTest$B05,
BasicRestInfoProvider.json, en)
XXX - InputStream1=null
XXX - TestClasspathResourceFinder.findResource(class org.apache.juneau.rest.BasicRestInfoProviderTest$C01,
BasicRestInfoProvider.json, en)
XXX - InputStream1=null
XXX - TestClasspathResourceFinder.findResource(class org.apache.juneau.rest.BasicRestInfoProviderTest$K01,
BasicRestInfoProvider.json, en)
XXX - InputStream1=null
XXX - TestClasspathResourceFinder.findResource(class org.apache.juneau.rest.BasicRestInfoProviderTest$J07,
BasicRestInfoProvider.json, en)
XXX - InputStream1=null
XXX - TestClasspathResourceFinder.findResource(class org.apache.juneau.rest.BasicRestInfoProviderTest$C05,
BasicRestInfoProvider.json, en)
XXX - InputStream1=null
XXX - TestClasspathResourceFinder.findResource(class org.apache.juneau.rest.BasicRestInfoProviderTest$B07,
BasicRestInfoProvider.json, en)
XXX - InputStream1=null
XXX - TestClasspathResourceFinder.findResource(class org.apache.juneau.rest.BasicRestInfoProviderTest$E01,
BasicRestInfoProvider.json, en)
XXX - InputStream1=null
XXX - TestClasspathResourceFinder.findResource(class org.apache.juneau.rest.BasicRestInfoProviderTest$J11,
BasicRestInfoProvider.json, en)
XXX - InputStream1=null
XXX - TestClasspathResourceFinder.findResource(class org.apache.juneau.rest.BasicRestInfoProviderTest$F04,
BasicRestInfoProvider.json, en)
XXX - InputStream1=null
XXX - TestClasspathResourceFinder.findResource(class org.apache.juneau.rest.BasicRestInfoProviderTest$A01,
BasicRestInfoProvider.json, en)
XXX - InputStream1=null
XXX - TestClasspathResourceFinder.findResource(class org.apache.juneau.rest.BasicRestInfoProviderTest$J10,
BasicRestInfoProvider.json, en)
XXX - InputStream1=null
XXX - TestClasspathResourceFinder.findResource(class org.apache.juneau.rest.BasicRestInfoProviderTest$J05,
BasicRestInfoProvider.json, en)
XXX - InputStream1=null
XXX - TestClasspathResourceFinder.findResource(class org.apache.juneau.rest.BasicRestInfoProviderTest$D01,
BasicRestInfoProvider.json, en)
XXX - InputStream1=null
XXX - TestClasspathResourceFinder.findResource(class org.apache.juneau.rest.BasicRestInfoProviderTest$D04,
BasicRestInfoProvider.json, en)
XXX - InputStream1=null
XXX - TestClasspathResourceFinder.findResource(class org.apache.juneau.rest.BasicRestInfoProviderTest$J12,
BasicRestInfoProvider.json, en)
XXX - InputStream1=null
XXX - TestClasspathResourceFinder.findResource(class org.apache.juneau.rest.BasicRestInfoProviderTest$C03,
BasicRestInfoProvider.json, en)
XXX - InputStream1=null
XXX - TestClasspathResourceFinder.findResource(class org.apache.juneau.rest.BasicRestInfoProviderTest$L01,
BasicRestInfoProvider.json, en)
XXX - InputStream1=null
XXX - TestClasspathResourceFinder.findResource(class org.apache.juneau.rest.BasicRestInfoProviderTest$J03,
BasicRestInfoProvider.json, en)
XXX - InputStream1=null
XXX - TestClasspathResourceFinder.findResource(class org.apache.juneau.rest.BasicRestInfoProviderTest$L04,
BasicRestInfoProvider.json, en)
XXX - InputStream1=null
XXX - TestClasspathResourceFinder.findResource(class org.apache.juneau.rest.BasicRestInfoProviderTest$G04,
BasicRestInfoProvider.json, en)
XXX - InputStream1=null
XXX - TestClasspathResourceFinder.findResource(class org.apache.juneau.rest.BasicRestInfoProviderTest$I02,
BasicRestInfoProvider.json, en)
XXX - InputStream1=null
XXX - TestClasspathResourceFinder.findResource(class org.apache.juneau.rest.BasicRestInfoProviderTest$L02,
BasicRestInfoProvider.json, en)
XXX - InputStream1=null
XXX - TestClasspathResourceFinder.findResource(class org.apache.juneau.rest.BasicRestInfoProviderTest$L03,
BasicRestInfoProvider.json, en)
XXX - InputStream1=null
XXX - TestClasspathResourceFinder.findResource(class org.apache.juneau.rest.BasicRestInfoProviderTest$D02,
BasicRestInfoProvider.json, en)
XXX - InputStream1=null
XXX - TestClasspathResourceFinder.findResource(class org.apache.juneau.rest.BasicRestInfoProviderTest$B02,
BasicRestInfoProvider.json, en)
XXX - InputStream1=null
XXX - TestClasspathResourceFinder.findResource(class org.apache.juneau.rest.BasicRestInfoProviderTest$J08,
BasicRestInfoProvider.json, en)
XXX - InputStream1=null
XXX - TestClasspathResourceFinder.findResource(class org.apache.juneau.rest.BasicRestInfoProviderTest$L05,
BasicRestInfoProvider.json, en)
XXX - InputStream1=null
XXX - TestClasspathResourceFinder.findResource(class org.apache.juneau.rest.BasicRestInfoProviderTest$J04,
BasicRestInfoProvider.json, en)
XXX - InputStream1=null
XXX - TestClasspathResourceFinder.findResource(class org.apache.juneau.rest.BasicRestInfoProviderTest$F03,
BasicRestInfoProvider.json, en)
XXX - InputStream1=null
XXX - TestClasspathResourceFinder.findResource(class org.apache.juneau.rest.BasicRestInfoProviderTest$G02,
BasicRestInfoProvider.json, en)
XXX - InputStream1=null
XXX - TestClasspathResourceFinder.findResource(class org.apache.juneau.rest.BasicRestInfoProviderTest$E04,
BasicRestInfoProvider.json, en)
XXX - InputStream1=null
Tests run: 57, Failures: 20, Errors: 0, Skipped: 0, Time elapsed: 1.222 sec <<< FAILURE!
- in org.apache.juneau.rest.BasicRestInfoProviderTest
f01_contact_default(org.apache.juneau.rest.BasicRestInfoProviderTest)  Time elapsed: 0.028
sec  <<< FAILURE!
org.junit.ComparisonFailure: expected:<[{name:'s-name',url:'s-url',email:'s-email'}]>
but was:<[null]>
	at org.apache.juneau.rest.BasicRestInfoProviderTest.f01_contact_default(BasicRestInfoProviderTest.java:334)

b01_title_RestResource_title(org.apache.juneau.rest.BasicRestInfoProviderTest)  Time elapsed:
0.01 sec  <<< FAILURE!
org.junit.ComparisonFailure: expected:<[s]-title> but was:<[a]-title>
	at org.apache.juneau.rest.BasicRestInfoProviderTest.b01_title_RestResource_title(BasicRestInfoProviderTest.java:94)

j09_tags_ResourceSwagger_tags_loose_cdl(org.apache.juneau.rest.BasicRestInfoProviderTest)
 Time elapsed: 0.056 sec  <<< FAILURE!
org.junit.ComparisonFailure: expected:<[{name:'[s-name',description:'s-description',externalDocs:{description:'s-description',url:'s-url'}},{name:']foo'},{name:'bar'}]>
but was:<[{name:'[]foo'},{name:'bar'}]>
	at org.apache.juneau.rest.BasicRestInfoProviderTest.j09_tags_ResourceSwagger_tags_loose_cdl(BasicRestInfoProviderTest.java:590)

j01_tags_default(org.apache.juneau.rest.BasicRestInfoProviderTest)  Time elapsed: 0.01 sec
 <<< FAILURE!
org.junit.ComparisonFailure: expected:<[[{name:'s-name',description:'s-description',externalDocs:{description:'s-description',url:'s-url'}}]]>
but was:<[null]>
	at org.apache.juneau.rest.BasicRestInfoProviderTest.j01_tags_default(BasicRestInfoProviderTest.java:502)

g01_license_default(org.apache.juneau.rest.BasicRestInfoProviderTest)  Time elapsed: 0.007
sec  <<< FAILURE!
org.junit.ComparisonFailure: expected:<[{name:'s-name',url:'s-url'}]> but was:<[null]>
	at org.apache.juneau.rest.BasicRestInfoProviderTest.g01_license_default(BasicRestInfoProviderTest.java:390)

h01_host_default(org.apache.juneau.rest.BasicRestInfoProviderTest)  Time elapsed: 0.008 sec
 <<< FAILURE!
java.lang.AssertionError: expected:<s-host> but was:<null>
	at org.apache.juneau.rest.BasicRestInfoProviderTest.h01_host_default(BasicRestInfoProviderTest.java:443)

i01_basePath_default(org.apache.juneau.rest.BasicRestInfoProviderTest)  Time elapsed: 0.008
sec  <<< FAILURE!
java.lang.AssertionError: expected:<s-basePath> but was:<null>
	at org.apache.juneau.rest.BasicRestInfoProviderTest.i01_basePath_default(BasicRestInfoProviderTest.java:468)

c02_description_RestResource_description_localized(org.apache.juneau.rest.BasicRestInfoProviderTest)
 Time elapsed: 0.007 sec  <<< FAILURE!
org.junit.ComparisonFailure: expected:<[s-description]> but was:<[l-foo]>
	at org.apache.juneau.rest.BasicRestInfoProviderTest.c02_description_RestResource_description_localized(BasicRestInfoProviderTest.java:179)

c01_description_RestResource_description(org.apache.juneau.rest.BasicRestInfoProviderTest)
 Time elapsed: 0.007 sec  <<< FAILURE!
org.junit.ComparisonFailure: expected:<[s]-description> but was:<[a]-description>
	at org.apache.juneau.rest.BasicRestInfoProviderTest.c01_description_RestResource_description(BasicRestInfoProviderTest.java:169)

k01_schemes_default(org.apache.juneau.rest.BasicRestInfoProviderTest)  Time elapsed: 0.006
sec  <<< FAILURE!
org.junit.ComparisonFailure: expected:<[['s-scheme']]> but was:<[null]>
	at org.apache.juneau.rest.BasicRestInfoProviderTest.k01_schemes_default(BasicRestInfoProviderTest.java:649)

e01_termsOfService_default(org.apache.juneau.rest.BasicRestInfoProviderTest)  Time elapsed:
0.006 sec  <<< FAILURE!
java.lang.AssertionError: expected:<s-termsOfService> but was:<null>
	at org.apache.juneau.rest.BasicRestInfoProviderTest.e01_termsOfService_default(BasicRestInfoProviderTest.java:288)

j11_tags_ResourceSwagger_tags_loose_objectlist_localized(org.apache.juneau.rest.BasicRestInfoProviderTest)
 Time elapsed: 0.008 sec  <<< FAILURE!
org.junit.ComparisonFailure: expected:<[{name:'[s-name',description:'s-description',externalDocs:{description:'s-description',url:'s-url'}},{name:']l-foo'},{name:'l-bar...>
but was:<[{name:'[]l-foo'},{name:'l-bar...>
	at org.apache.juneau.rest.BasicRestInfoProviderTest.j11_tags_ResourceSwagger_tags_loose_objectlist_localized(BasicRestInfoProviderTest.java:618)

a01_swagger_default(org.apache.juneau.rest.BasicRestInfoProviderTest)  Time elapsed: 0.006
sec  <<< FAILURE!
org.junit.ComparisonFailure: expected:<[0].0> but was:<[2].0>
	at org.apache.juneau.rest.BasicRestInfoProviderTest.a01_swagger_default(BasicRestInfoProviderTest.java:69)

j10_tags_ResourceSwagger_tags_loose_objectlist(org.apache.juneau.rest.BasicRestInfoProviderTest)
 Time elapsed: 0.01 sec  <<< FAILURE!
org.junit.ComparisonFailure: expected:<[{name:'[s-name',description:'s-description',externalDocs:{description:'s-description',url:'s-url'}},{name:']foo'},{name:'bar'}]>
but was:<[{name:'[]foo'},{name:'bar'}]>
	at org.apache.juneau.rest.BasicRestInfoProviderTest.j10_tags_ResourceSwagger_tags_loose_objectlist(BasicRestInfoProviderTest.java:604)

j05_tags_ResourceSwagger_tags_only(org.apache.juneau.rest.BasicRestInfoProviderTest)  Time
elapsed: 0.008 sec  <<< FAILURE!
org.junit.ComparisonFailure: expected:<[{name:'[s-name',description:'s-description',externalDocs:{description:'s-description',url:'s-url'}},{name:']b-name',description:...>
but was:<[{name:'[]b-name',description:...>
	at org.apache.juneau.rest.BasicRestInfoProviderTest.j05_tags_ResourceSwagger_tags_only(BasicRestInfoProviderTest.java:542)

d01_version_default(org.apache.juneau.rest.BasicRestInfoProviderTest)  Time elapsed: 0.006
sec  <<< FAILURE!
java.lang.AssertionError: expected:<0.0.0> but was:<null>
	at org.apache.juneau.rest.BasicRestInfoProviderTest.d01_version_default(BasicRestInfoProviderTest.java:244)

j12_tags_ResourceSwagger_tags_loose_cdl_localized(org.apache.juneau.rest.BasicRestInfoProviderTest)
 Time elapsed: 0.009 sec  <<< FAILURE!
org.junit.ComparisonFailure: expected:<[{name:'[s-name',description:'s-description',externalDocs:{description:'s-description',url:'s-url'}},{name:']l-foo'},{name:'l-bar...>
but was:<[{name:'[]l-foo'},{name:'l-bar...>
	at org.apache.juneau.rest.BasicRestInfoProviderTest.j12_tags_ResourceSwagger_tags_loose_cdl_localized(BasicRestInfoProviderTest.java:632)

l01_externalDocs_default(org.apache.juneau.rest.BasicRestInfoProviderTest)  Time elapsed:
0.007 sec  <<< FAILURE!
org.junit.ComparisonFailure: expected:<[{description:'s-description',url:'s-url'}]>
but was:<[null]>
	at org.apache.juneau.rest.BasicRestInfoProviderTest.l01_externalDocs_default(BasicRestInfoProviderTest.java:677)

b02_title_RestResource_title_localized(org.apache.juneau.rest.BasicRestInfoProviderTest) 
Time elapsed: 0.006 sec  <<< FAILURE!
org.junit.ComparisonFailure: expected:<[s-title]> but was:<[l-foo]>
	at org.apache.juneau.rest.BasicRestInfoProviderTest.b02_title_RestResource_title_localized(BasicRestInfoProviderTest.java:104)

j08_tags_ResourceSwagger_tags_loose(org.apache.juneau.rest.BasicRestInfoProviderTest)  Time
elapsed: 0.007 sec  <<< FAILURE!
org.junit.ComparisonFailure: expected:<[{name:'[s-name',description:'s-description',externalDocs:{description:'s-description',url:'s-url'}},{name:']foo'}]>
but was:<[{name:'[]foo'}]>
	at org.apache.juneau.rest.BasicRestInfoProviderTest.j08_tags_ResourceSwagger_tags_loose(BasicRestInfoProviderTest.java:576)

[BeanContext] = [2,114,98%]
[Config] = [114,0,0%]
[JsonSerializer] = [5,0,0%]
[total] = [121,114,48%]

Results :

Failed tests: 
  BasicRestInfoProviderTest.a01_swagger_default:69 expected:<[0].0> but was:<[2].0>
  BasicRestInfoProviderTest.b01_title_RestResource_title:94 expected:<[s]-title> but
was:<[a]-title>
  BasicRestInfoProviderTest.b02_title_RestResource_title_localized:104 expected:<[s-title]>
but was:<[l-foo]>
  BasicRestInfoProviderTest.c01_description_RestResource_description:169 expected:<[s]-description>
but was:<[a]-description>
  BasicRestInfoProviderTest.c02_description_RestResource_description_localized:179 expected:<[s-description]>
but was:<[l-foo]>
  BasicRestInfoProviderTest.d01_version_default:244 expected:<0.0.0> but was:<null>
  BasicRestInfoProviderTest.e01_termsOfService_default:288 expected:<s-termsOfService>
but was:<null>
  BasicRestInfoProviderTest.f01_contact_default:334 expected:<[{name:'s-name',url:'s-url',email:'s-email'}]>
but was:<[null]>
  BasicRestInfoProviderTest.g01_license_default:390 expected:<[{name:'s-name',url:'s-url'}]>
but was:<[null]>
  BasicRestInfoProviderTest.h01_host_default:443 expected:<s-host> but was:<null>
  BasicRestInfoProviderTest.i01_basePath_default:468 expected:<s-basePath> but was:<null>
  BasicRestInfoProviderTest.j01_tags_default:502 expected:<[[{name:'s-name',description:'s-description',externalDocs:{description:'s-description',url:'s-url'}}]]>
but was:<[null]>
  BasicRestInfoProviderTest.j05_tags_ResourceSwagger_tags_only:542 expected:<[{name:'[s-name',description:'s-description',externalDocs:{description:'s-description',url:'s-url'}},{name:']b-name',description:...>
but was:<[{name:'[]b-name',description:...>
  BasicRestInfoProviderTest.j08_tags_ResourceSwagger_tags_loose:576 expected:<[{name:'[s-name',description:'s-description',externalDocs:{description:'s-description',url:'s-url'}},{name:']foo'}]>
but was:<[{name:'[]foo'}]>
  BasicRestInfoProviderTest.j09_tags_ResourceSwagger_tags_loose_cdl:590 expected:<[{name:'[s-name',description:'s-description',externalDocs:{description:'s-description',url:'s-url'}},{name:']foo'},{name:'bar'}]>
but was:<[{name:'[]foo'},{name:'bar'}]>
  BasicRestInfoProviderTest.j10_tags_ResourceSwagger_tags_loose_objectlist:604 expected:<[{name:'[s-name',description:'s-description',externalDocs:{description:'s-description',url:'s-url'}},{name:']foo'},{name:'bar'}]>
but was:<[{name:'[]foo'},{name:'bar'}]>
  BasicRestInfoProviderTest.j11_tags_ResourceSwagger_tags_loose_objectlist_localized:618 expected:<[{name:'[s-name',description:'s-description',externalDocs:{description:'s-description',url:'s-url'}},{name:']l-foo'},{name:'l-bar...>
but was:<[{name:'[]l-foo'},{name:'l-bar...>
  BasicRestInfoProviderTest.j12_tags_ResourceSwagger_tags_loose_cdl_localized:632 expected:<[{name:'[s-name',description:'s-description',externalDocs:{description:'s-description',url:'s-url'}},{name:']l-foo'},{name:'l-bar...>
but was:<[{name:'[]l-foo'},{name:'l-bar...>
  BasicRestInfoProviderTest.k01_schemes_default:649 expected:<[['s-scheme']]> but was:<[null]>
  BasicRestInfoProviderTest.l01_externalDocs_default:677 expected:<[{description:'s-description',url:'s-url'}]>
but was:<[null]>

Tests run: 57, Failures: 20, Errors: 0, Skipped: 0

[INFO] ------------------------------------------------------------------------
[INFO] Reactor Summary:
[INFO] 
[INFO] Apache Juneau ...................................... SUCCESS [  5.851 s]
[INFO] Apache Juneau - Core APIs .......................... SUCCESS [  3.174 s]
[INFO] Apache Juneau Marshall ............................. SUCCESS [ 24.728 s]
[INFO] Apache Juneau Marshal RDF .......................... SUCCESS [  8.628 s]
[INFO] Apache Juneau Data Transfer Objects ................ SUCCESS [ 10.714 s]
[INFO] Apache Juneau Core ................................. SUCCESS [  7.594 s]
[INFO] Apache Juneau Config File API ...................... SUCCESS [  7.874 s]
[INFO] Apache Juneau Core Tests ........................... SUCCESS [ 33.883 s]
[INFO] Apache Juneau - REST APIs .......................... SUCCESS [  2.927 s]
[INFO] Apache Juneau REST Servlet API ..................... FAILURE [  2.724 s]
[INFO] Apache Juneau REST JAX/RS API ...................... SKIPPED
[INFO] Apache Juneau REST Client API ...................... SKIPPED
[INFO] Apache Juneau - Microservice APIs .................. SKIPPED
[INFO] Apache Juneau Microservice Server .................. SKIPPED
[INFO] Apache Juneau Microservice Template ................ SKIPPED
[INFO] Apache Juneau - Examples ........................... SKIPPED
[INFO] Apache Juneau REST Examples ........................ SKIPPED
[INFO] Apache Juneau Microservice Tests ................... SKIPPED
[INFO] Apache Juneau Core Examples ........................ SKIPPED
[INFO] Apache Juneau Javadocs ............................. SKIPPED
[INFO] Apache Juneau - Release Engineering ................ SKIPPED
[INFO] Apache Juneau UberJar .............................. SKIPPED
[INFO] Apache Juneau Distribution ......................... SKIPPED
[INFO] ------------------------------------------------------------------------
[INFO] BUILD FAILURE
[INFO] ------------------------------------------------------------------------
[INFO] Total time: 01:49 min
[INFO] Finished at: 2018-04-21T21:31:04+00:00
[INFO] Final Memory: 71M/3552M
[INFO] ------------------------------------------------------------------------
[ERROR] Failed to execute goal org.apache.maven.plugins:maven-surefire-plugin:2.19.1:test
(default-test) on project juneau-rest-server: There are test failures.
[ERROR] 
[ERROR] Please refer to <https://builds.apache.org/job/Juneau-Java-1.8/ws/juneau-rest/juneau-rest-server/target/surefire-reports>
for the individual test results.
[ERROR] -> [Help 1]
[ERROR] 
[ERROR] To see the full stack trace of the errors, re-run Maven with the -e switch.
[ERROR] Re-run Maven using the -X switch to enable full debug logging.
[ERROR] 
[ERROR] For more information about the errors and possible solutions, please read the following
articles:
[ERROR] [Help 1] http://cwiki.apache.org/confluence/display/MAVEN/MojoFailureException
[ERROR] 
[ERROR] After correcting the problems, you can resume the build with the command
[ERROR]   mvn <goals> -rf :juneau-rest-server
Build step 'Invoke top-level Maven targets' marked build as failure

Mime
View raw message