juneau-dev mailing list archives

Site index · List index
Message view « Date » · « Thread »
Top « Date » · « Thread »
From Apache Jenkins Server <jenk...@builds.apache.org>
Subject Build failed in Jenkins: Juneau-Java-1.8 #727
Date Mon, 05 Mar 2018 14:35:16 GMT
See <https://builds.apache.org/job/Juneau-Java-1.8/727/display/redirect>

------------------------------------------
[...truncated 10.88 KB...]
[INFO] Exclude: **/.settings/**
[INFO] Exclude: **/.project
[INFO] Exclude: **/.classpath
[INFO] Exclude: **/*.launch
[INFO] Exclude: **/jetty.out.xml
[INFO] Exclude: **/dependency-reduced-pom.xml
[INFO] 1 resources included (use -debug for more details)
[INFO] Rat check: Summary of files. Unapproved: 0 unknown: 0 generated: 0 approved: 1 licence.
[INFO] 
[INFO] --- maven-install-plugin:2.5.2:install (default-install) @ juneau-core ---
[INFO] Installing <https://builds.apache.org/job/Juneau-Java-1.8/ws/juneau-core/pom.xml>
to /home/jenkins/.m2/repository/org/apache/juneau/juneau-core/7.1.1-SNAPSHOT/juneau-core-7.1.1-SNAPSHOT.pom
[INFO] 
[INFO] --- maven-enforcer-plugin:1.4.1:enforce (enforce-maven) @ juneau-core ---
[INFO] 
[INFO] --- maven-remote-resources-plugin:1.5:process (process-resource-bundles) @ juneau-core
---
[INFO] 
[INFO] --- maven-site-plugin:3.5.1:attach-descriptor (attach-descriptor) @ juneau-core ---
[INFO] 
[INFO] --- apache-rat-plugin:0.11:check (default) @ juneau-core ---
[INFO] 57 implicit excludes (use -debug for more details).
[INFO] Exclude: **/DEPENDENCIES
[INFO] Exclude: **/target/**
[INFO] Exclude: **/.settings/**
[INFO] Exclude: **/.project
[INFO] Exclude: **/.classpath
[INFO] Exclude: **/*.launch
[INFO] Exclude: **/jetty.out.xml
[INFO] Exclude: **/dependency-reduced-pom.xml
[INFO] 1 resources included (use -debug for more details)
[INFO] Rat check: Summary of files. Unapproved: 0 unknown: 0 generated: 0 approved: 1 licence.
[INFO] 
[INFO] --- maven-install-plugin:2.5.2:install (default-install) @ juneau-core ---
[INFO] Installing <https://builds.apache.org/job/Juneau-Java-1.8/ws/juneau-core/pom.xml>
to /home/jenkins/.m2/repository/org/apache/juneau/juneau-core/7.1.1-SNAPSHOT/juneau-core-7.1.1-SNAPSHOT.pom
[INFO] 
[INFO] --- maven-deploy-plugin:2.8.2:deploy (default-deploy) @ juneau-core ---
Downloading: https://repository.apache.org/content/repositories/snapshots/org/apache/juneau/juneau-core/7.1.1-SNAPSHOT/maven-metadata.xml
607/607 B               Downloaded: https://repository.apache.org/content/repositories/snapshots/org/apache/juneau/juneau-core/7.1.1-SNAPSHOT/maven-metadata.xml
(607 B at 1.3 KB/sec)
Uploading: https://repository.apache.org/content/repositories/snapshots/org/apache/juneau/juneau-core/7.1.1-SNAPSHOT/juneau-core-7.1.1-20180305.143444-16.pom
2/3 KB      3/3 KB            Uploaded: https://repository.apache.org/content/repositories/snapshots/org/apache/juneau/juneau-core/7.1.1-SNAPSHOT/juneau-core-7.1.1-20180305.143444-16.pom
(3 KB at 3.3 KB/sec)
Downloading: https://repository.apache.org/content/repositories/snapshots/org/apache/juneau/juneau-core/maven-metadata.xml
683/683 B               Downloaded: https://repository.apache.org/content/repositories/snapshots/org/apache/juneau/juneau-core/maven-metadata.xml
(683 B at 1.5 KB/sec)
Uploading: https://repository.apache.org/content/repositories/snapshots/org/apache/juneau/juneau-core/7.1.1-SNAPSHOT/maven-metadata.xml
607/607 B               Uploaded: https://repository.apache.org/content/repositories/snapshots/org/apache/juneau/juneau-core/7.1.1-SNAPSHOT/maven-metadata.xml
(607 B at 0.9 KB/sec)
Uploading: https://repository.apache.org/content/repositories/snapshots/org/apache/juneau/juneau-core/maven-metadata.xml
683/683 B               Uploaded: https://repository.apache.org/content/repositories/snapshots/org/apache/juneau/juneau-core/maven-metadata.xml
(683 B at 1.0 KB/sec)
[INFO]                                                                         
[INFO] ------------------------------------------------------------------------
[INFO] Building Apache Juneau Marshall 7.1.1-SNAPSHOT
[INFO] ------------------------------------------------------------------------
[INFO] 
[INFO] --- maven-clean-plugin:3.0.0:clean (default-clean) @ juneau-marshall ---
[INFO] Deleting <https://builds.apache.org/job/Juneau-Java-1.8/ws/juneau-core/juneau-marshall/target>
[INFO] 
[INFO] --- maven-enforcer-plugin:1.4.1:enforce (enforce-maven) @ juneau-marshall ---
[INFO] 
[INFO] --- jacoco-maven-plugin:0.7.2.201409121644:prepare-agent (default-prepare-agent) @
juneau-marshall ---
[INFO] argLine set to -javaagent:/home/jenkins/.m2/repository/org/jacoco/org.jacoco.agent/0.7.2.201409121644/org.jacoco.agent-0.7.2.201409121644-runtime.jar=destfile=<https://builds.apache.org/job/Juneau-Java-1.8/ws/juneau-core/juneau-marshall/target/jacoco.exec>
[INFO] 
[INFO] --- maven-remote-resources-plugin:1.5:process (process-resource-bundles) @ juneau-marshall
---
[INFO] 
[INFO] --- maven-resources-plugin:2.7:resources (default-resources) @ juneau-marshall ---
[INFO] Using 'UTF-8' encoding to copy filtered resources.
[INFO] Copying 1 resource
[INFO] Copying 3 resources
[INFO] 
[INFO] --- maven-compiler-plugin:3.5.1:compile (default-compile) @ juneau-marshall ---
[INFO] Changes detected - recompiling the module!
[INFO] Compiling 413 source files to <https://builds.apache.org/job/Juneau-Java-1.8/ws/juneau-core/juneau-marshall/target/classes>
[INFO] <https://builds.apache.org/job/Juneau-Java-1.8/ws/juneau-core/juneau-marshall/src/main/java/org/apache/juneau/internal/StringUtils.java>:
Some input files use unchecked or unsafe operations.
[INFO] <https://builds.apache.org/job/Juneau-Java-1.8/ws/juneau-core/juneau-marshall/src/main/java/org/apache/juneau/internal/StringUtils.java>:
Recompile with -Xlint:unchecked for details.
[INFO] 
[INFO] --- maven-resources-plugin:2.7:testResources (default-testResources) @ juneau-marshall
---
[INFO] Using 'UTF-8' encoding to copy filtered resources.
[INFO] skip non existing resourceDirectory <https://builds.apache.org/job/Juneau-Java-1.8/ws/juneau-core/juneau-marshall/src/test/resources>
[INFO] Copying 3 resources
[INFO] 
[INFO] --- maven-compiler-plugin:3.5.1:testCompile (default-testCompile) @ juneau-marshall
---
[INFO] No sources to compile
[INFO] 
[INFO] --- maven-surefire-plugin:2.19.1:test (default-test) @ juneau-marshall ---
[INFO] 
[INFO] --- jacoco-maven-plugin:0.7.2.201409121644:report (default-report) @ juneau-marshall
---
[INFO] Skipping JaCoCo execution due to missing execution data <https://builds.apache.org/job/Juneau-Java-1.8/ws/juneau-core/juneau-marshall/target/jacoco.exec>
[INFO] 
[INFO] --- maven-bundle-plugin:3.2.0:bundle (default-bundle) @ juneau-marshall ---
[WARNING] Bundle org.apache.juneau:juneau-marshall:bundle:7.1.1-SNAPSHOT : Export org.apache.juneau,
 has 1,  private references [org.apache.juneau.internal], 
[INFO] 
[INFO] --- maven-site-plugin:3.5.1:attach-descriptor (attach-descriptor) @ juneau-marshall
---
[INFO] 
[INFO] --- apache-rat-plugin:0.11:check (default) @ juneau-marshall ---
[INFO] 51 implicit excludes (use -debug for more details).
[INFO] Exclude: **/DEPENDENCIES
[INFO] Exclude: **/target/**
[INFO] Exclude: **/.settings/**
[INFO] Exclude: **/.project
[INFO] Exclude: **/.classpath
[INFO] Exclude: **/*.launch
[INFO] Exclude: **/jetty.out.xml
[INFO] Exclude: **/dependency-reduced-pom.xml
[INFO] 446 resources included (use -debug for more details)
[INFO] Rat check: Summary of files. Unapproved: 0 unknown: 0 generated: 0 approved: 428 licence.
[INFO] 
[INFO] --- maven-source-plugin:3.0.0:jar-no-fork (attach-sources) @ juneau-marshall ---
[INFO] Building jar: <https://builds.apache.org/job/Juneau-Java-1.8/ws/juneau-core/juneau-marshall/target/juneau-marshall-7.1.1-SNAPSHOT-sources.jar>
[INFO] 
[INFO] --- maven-install-plugin:2.5.2:install (default-install) @ juneau-marshall ---
[INFO] Installing <https://builds.apache.org/job/Juneau-Java-1.8/ws/juneau-core/juneau-marshall/target/juneau-marshall-7.1.1-SNAPSHOT.jar>
to /home/jenkins/.m2/repository/org/apache/juneau/juneau-marshall/7.1.1-SNAPSHOT/juneau-marshall-7.1.1-SNAPSHOT.jar
[INFO] Installing <https://builds.apache.org/job/Juneau-Java-1.8/ws/juneau-core/juneau-marshall/pom.xml>
to /home/jenkins/.m2/repository/org/apache/juneau/juneau-marshall/7.1.1-SNAPSHOT/juneau-marshall-7.1.1-SNAPSHOT.pom
[INFO] Installing <https://builds.apache.org/job/Juneau-Java-1.8/ws/juneau-core/juneau-marshall/target/juneau-marshall-7.1.1-SNAPSHOT-sources.jar>
to /home/jenkins/.m2/repository/org/apache/juneau/juneau-marshall/7.1.1-SNAPSHOT/juneau-marshall-7.1.1-SNAPSHOT-sources.jar
[INFO] 
[INFO] --- maven-bundle-plugin:3.2.0:install (default-install) @ juneau-marshall ---
[INFO] Installing org/apache/juneau/juneau-marshall/7.1.1-SNAPSHOT/juneau-marshall-7.1.1-SNAPSHOT.jar
[INFO] Writing OBR metadata
[INFO] 
[INFO] --- maven-enforcer-plugin:1.4.1:enforce (enforce-maven) @ juneau-marshall ---
[INFO] 
[INFO] --- jacoco-maven-plugin:0.7.2.201409121644:prepare-agent (default-prepare-agent) @
juneau-marshall ---
[INFO] argLine set to -javaagent:/home/jenkins/.m2/repository/org/jacoco/org.jacoco.agent/0.7.2.201409121644/org.jacoco.agent-0.7.2.201409121644-runtime.jar=destfile=<https://builds.apache.org/job/Juneau-Java-1.8/ws/juneau-core/juneau-marshall/target/jacoco.exec>
[INFO] 
[INFO] --- maven-remote-resources-plugin:1.5:process (process-resource-bundles) @ juneau-marshall
---
[INFO] 
[INFO] --- maven-resources-plugin:2.7:resources (default-resources) @ juneau-marshall ---
[INFO] Using 'UTF-8' encoding to copy filtered resources.
[INFO] Copying 1 resource
[INFO] Copying 3 resources
[INFO] Copying 3 resources
[INFO] 
[INFO] --- maven-compiler-plugin:3.5.1:compile (default-compile) @ juneau-marshall ---
[INFO] Changes detected - recompiling the module!
[INFO] Compiling 413 source files to <https://builds.apache.org/job/Juneau-Java-1.8/ws/juneau-core/juneau-marshall/target/classes>
[INFO] <https://builds.apache.org/job/Juneau-Java-1.8/ws/juneau-core/juneau-marshall/src/main/java/org/apache/juneau/internal/StringUtils.java>:
Some input files use unchecked or unsafe operations.
[INFO] <https://builds.apache.org/job/Juneau-Java-1.8/ws/juneau-core/juneau-marshall/src/main/java/org/apache/juneau/internal/StringUtils.java>:
Recompile with -Xlint:unchecked for details.
[INFO] 
[INFO] --- maven-resources-plugin:2.7:testResources (default-testResources) @ juneau-marshall
---
[INFO] Using 'UTF-8' encoding to copy filtered resources.
[INFO] skip non existing resourceDirectory <https://builds.apache.org/job/Juneau-Java-1.8/ws/juneau-core/juneau-marshall/src/test/resources>
[INFO] Copying 3 resources
[INFO] Copying 3 resources
[INFO] 
[INFO] --- maven-compiler-plugin:3.5.1:testCompile (default-testCompile) @ juneau-marshall
---
[INFO] No sources to compile
[INFO] 
[INFO] --- maven-surefire-plugin:2.19.1:test (default-test) @ juneau-marshall ---
[INFO] Skipping execution of surefire because it has already been run for this configuration
[INFO] 
[INFO] --- jacoco-maven-plugin:0.7.2.201409121644:report (default-report) @ juneau-marshall
---
[INFO] Skipping JaCoCo execution due to missing execution data <https://builds.apache.org/job/Juneau-Java-1.8/ws/juneau-core/juneau-marshall/target/jacoco.exec>
[INFO] 
[INFO] --- maven-bundle-plugin:3.2.0:bundle (default-bundle) @ juneau-marshall ---
[WARNING] Bundle org.apache.juneau:juneau-marshall:bundle:7.1.1-SNAPSHOT : Export org.apache.juneau,
 has 1,  private references [org.apache.juneau.internal], 
[INFO] 
[INFO] --- maven-site-plugin:3.5.1:attach-descriptor (attach-descriptor) @ juneau-marshall
---
[INFO] 
[INFO] --- apache-rat-plugin:0.11:check (default) @ juneau-marshall ---
[INFO] 51 implicit excludes (use -debug for more details).
[INFO] Exclude: **/DEPENDENCIES
[INFO] Exclude: **/target/**
[INFO] Exclude: **/.settings/**
[INFO] Exclude: **/.project
[INFO] Exclude: **/.classpath
[INFO] Exclude: **/*.launch
[INFO] Exclude: **/jetty.out.xml
[INFO] Exclude: **/dependency-reduced-pom.xml
[INFO] 446 resources included (use -debug for more details)
[INFO] Rat check: Summary of files. Unapproved: 0 unknown: 0 generated: 0 approved: 428 licence.
[INFO] 
[INFO] --- maven-source-plugin:3.0.0:jar-no-fork (attach-sources) @ juneau-marshall ---
[INFO] Building jar: <https://builds.apache.org/job/Juneau-Java-1.8/ws/juneau-core/juneau-marshall/target/juneau-marshall-7.1.1-SNAPSHOT-sources.jar>
[INFO] 
[INFO] --- maven-install-plugin:2.5.2:install (default-install) @ juneau-marshall ---
[INFO] Installing <https://builds.apache.org/job/Juneau-Java-1.8/ws/juneau-core/juneau-marshall/target/juneau-marshall-7.1.1-SNAPSHOT.jar>
to /home/jenkins/.m2/repository/org/apache/juneau/juneau-marshall/7.1.1-SNAPSHOT/juneau-marshall-7.1.1-SNAPSHOT.jar
[INFO] Installing <https://builds.apache.org/job/Juneau-Java-1.8/ws/juneau-core/juneau-marshall/pom.xml>
to /home/jenkins/.m2/repository/org/apache/juneau/juneau-marshall/7.1.1-SNAPSHOT/juneau-marshall-7.1.1-SNAPSHOT.pom
[INFO] Installing <https://builds.apache.org/job/Juneau-Java-1.8/ws/juneau-core/juneau-marshall/target/juneau-marshall-7.1.1-SNAPSHOT-sources.jar>
to /home/jenkins/.m2/repository/org/apache/juneau/juneau-marshall/7.1.1-SNAPSHOT/juneau-marshall-7.1.1-SNAPSHOT-sources.jar
[INFO] Installing <https://builds.apache.org/job/Juneau-Java-1.8/ws/juneau-core/juneau-marshall/target/juneau-marshall-7.1.1-SNAPSHOT-sources.jar>
to /home/jenkins/.m2/repository/org/apache/juneau/juneau-marshall/7.1.1-SNAPSHOT/juneau-marshall-7.1.1-SNAPSHOT-sources.jar
[INFO] 
[INFO] --- maven-bundle-plugin:3.2.0:install (default-install) @ juneau-marshall ---
[INFO] Installing org/apache/juneau/juneau-marshall/7.1.1-SNAPSHOT/juneau-marshall-7.1.1-SNAPSHOT.jar
[INFO] Writing OBR metadata
[INFO] 
[INFO] --- maven-deploy-plugin:2.8.2:deploy (default-deploy) @ juneau-marshall ---
Downloading: https://repository.apache.org/content/repositories/snapshots/org/apache/juneau/juneau-marshall/7.1.1-SNAPSHOT/maven-metadata.xml
1000/1000 B                 Downloaded: https://repository.apache.org/content/repositories/snapshots/org/apache/juneau/juneau-marshall/7.1.1-SNAPSHOT/maven-metadata.xml
(1000 B at 2.1 KB/sec)
Uploading: https://repository.apache.org/content/repositories/snapshots/org/apache/juneau/juneau-marshall/7.1.1-SNAPSHOT/juneau-marshall-7.1.1-20180305.143507-16.jar
2/1003 KB     4/1003 KB   6/1003 KB   8/1003 KB   10/1003 KB   12/1003 KB   14/1003 KB   16/1003
KB   18/1003 KB   20/1003 KB   22/1003 KB   24/1003 KB   26/1003 KB   28/1003 KB   30/1003
KB   32/1003 KB   34/1003 KB   36/1003 KB   38/1003 KB   40/1003 KB   42/1003 KB   44/1003
KB   46/1003 KB   48/1003 KB   50/1003 KB   52/1003 KB   54/1003 KB   56/1003 KB   58/1003
KB   60/1003 KB   62/1003 KB   64/1003 KB   66/1003 KB   68/1003 KB   70/1003 KB   72/1003
KB   74/1003 KB   76/1003 KB   78/1003 KB   80/1003 KB   82/1003 KB   84/1003 KB   86/1003
KB   88/1003 KB   90/1003 KB   92/1003 KB   94/1003 KB   96/1003 KB   98/1003 KB   100/1003
KB   102/1003 KB   104/1003 KB   106/1003 KB   108/1003 KB   110/1003 KB   112/1003 KB   114/1003
KB   116/1003 KB   118/1003 KB   120/1003 KB   122/1003 KB   124/1003 KB   126/1003 KB   128/1003
KB   130/1003 KB   132/1003 KB   134/1003 KB   136/1003 KB   138/1003 KB   140/1003 KB   142/1003
KB   144/1003 KB   146/1003 KB   148/1003 KB   150/1003 KB   152/1003 KB   154/1003 KB   156/1003
KB   158/1003 KB   160/1003 KB   162/1003 KB   164/1003 KB   166/1003 KB   168/1003 KB   170/1003
KB   172/1003 KB   174/1003 KB   176/1003 KB   178/1003 KB   180/1003 KB   182/1003 KB   184/1003
KB   186/1003 KB   188/1003 KB   190/1003 KB   192/1003 KB   194/1003 KB   196/1003 KB   198/1003
KB   200/1003 KB   202/1003 KB   204/1003 KB   206/1003 KB   208/1003 KB   210/1003 KB   212/1003
KB   214/1003 KB   216/1003 KB   218/1003 KB   220/1003 KB   222/1003 KB   224/1003 KB   226/1003
KB   228/1003 KB   230/1003 KB   232/1003 KB   234/1003 KB   236/1003 KB   238/1003 KB   240/1003
KB   242/1003 KB   244/1003 KB   246/1003 KB   248/1003 KB   250/1003 KB   252/1003 KB   254/1003
KB   256/1003 KB   258/1003 KB   260/1003 KB   262/1003 KB   264/1003 KB   266/1003 KB   268/1003
KB   270/1003 KB   272/1003 KB   274/1003 KB   276/1003 KB   278/1003 KB   280/1003 KB   282/1003
KB   284/1003 KB   286/1003 KB   288/1003 KB   290/1003 KB   292/1003 KB   294/1003 KB   296/1003
KB   298/1003 KB   300/1003 KB   302/1003 KB   304/1003 KB   306/1003 KB   308/1003 KB   310/1003
KB   312/1003 KB   314/1003 KB   316/1003 KB   318/1003 KB   320/1003 KB   322/1003 KB   324/1003
KB   326/1003 KB   328/1003 KB   330/1003 KB   332/1003 KB   334/1003 KB   336/1003 KB   338/1003
KB   340/1003 KB   342/1003 KB   344/1003 KB   346/1003 KB   348/1003 KB   350/1003 KB   352/1003
KB   354/1003 KB   356/1003 KB   358/1003 KB   360/1003 KB   362/1003 KB   364/1003 KB   366/1003
KB   368/1003 KB   370/1003 KB   372/1003 KB   374/1003 KB   376/1003 KB   378/1003 KB   380/1003
KB   382/1003 KB   384/1003 KB   386/1003 KB   388/1003 KB   390/1003 KB   392/1003 KB   394/1003
KB   396/1003 KB   398/1003 KB   400/1003 KB   402/1003 KB   404/1003 KB   406/1003 KB   408/1003
KB   410/1003 KB   412/1003 KB   414/1003 KB   416/1003 KB   418/1003 KB   420/1003 KB   422/1003
KB   424/1003 KB   426/1003 KB   428/1003 KB   430/1003 KB   432/1003 KB   434/1003 KB   436/1003
KB   438/1003 KB   440/1003 KB   442/1003 KB   444/1003 KB   446/1003 KB   448/1003 KB   450/1003
KB   452/1003 KB   454/1003 KB   456/1003 KB   458/1003 KB   460/1003 KB   462/1003 KB   464/1003
KB   466/1003 KB   468/1003 KB   470/1003 KB   472/1003 KB   474/1003 KB   476/1003 KB   478/1003
KB   480/1003 KB   482/1003 KB   484/1003 KB   486/1003 KB   488/1003 KB   490/1003 KB   492/1003
KB   494/1003 KB   496/1003 KB   498/1003 KB   500/1003 KB   502/1003 KB   504/1003 KB   506/1003
KB   508/1003 KB   510/1003 KB   512/1003 KB   514/1003 KB   516/1003 KB   518/1003 KB   520/1003
KB   522/1003 KB   524/1003 KB   526/1003 KB   528/1003 KB   530/1003 KB   532/1003 KB   534/1003
KB   536/1003 KB   538/1003 KB   540/1003 KB   542/1003 KB   544/1003 KB   546/1003 KB   548/1003
KB   550/1003 KB   552/1003 KB   554/1003 KB   556/1003 KB   558/1003 KB   560/1003 KB   562/1003
KB   564/1003 KB   566/1003 KB   568/1003 KB   570/1003 KB   572/1003 KB   574/1003 KB   576/1003
KB   578/1003 KB   580/1003 KB   582/1003 KB   584/1003 KB   586/1003 KB   588/1003 KB   590/1003
KB   592/1003 KB   594/1003 KB   596/1003 KB   598/1003 KB   600/1003 KB   602/1003 KB   604/1003
KB   606/1003 KB   608/1003 KB   610/1003 KB   612/1003 KB   614/1003 KB   616/1003 KB   618/1003
KB   620/1003 KB   622/1003 KB   624/1003 KB   626/1003 KB   628/1003 KB   630/1003 KB   632/1003
KB   634/1003 KB   636/1003 KB   638/1003 KB   640/1003 KB   642/1003 KB   644/1003 KB   646/1003
KB   648/1003 KB   650/1003 KB   652/1003 KB   654/1003 KB   656/1003 KB   658/1003 KB   660/1003
KB   662/1003 KB   664/1003 KB   666/1003 KB   668/1003 KB   670/1003 KB   672/1003 KB   674/1003
KB   676/1003 KB   678/1003 KB   680/1003 KB   682/1003 KB   684/1003 KB   686/1003 KB   688/1003
KB   690/1003 KB   692/1003 KB   694/1003 KB   696/1003 KB   698/1003 KB   700/1003 KB   702/1003
KB   704/1003 KB   706/1003 KB   708/1003 KB   710/1003 KB   712/1003 KB   714/1003 KB   716/1003
KB   718/1003 KB   720/1003 KB   722/1003 KB   724/1003 KB   726/1003 KB   728/1003 KB   730/1003
KB   732/1003 KB   734/1003 KB   736/1003 KB   738/1003 KB   740/1003 KB   742/1003 KB   744/1003
KB   746/1003 KB   748/1003 KB   750/1003 KB   752/1003 KB   754/1003 KB   756/1003 KB   758/1003
KB   760/1003 KB   762/1003 KB   764/1003 KB   766/1003 KB   768/1003 KB   770/1003 KB   772/1003
KB   774/1003 KB   776/1003 KB   778/1003 KB   780/1003 KB   782/1003 KB   784/1003 KB   786/1003
KB   788/1003 KB   790/1003 KB   792/1003 KB   794/1003 KB   796/1003 KB   798/1003 KB   800/1003
KB   802/1003 KB   804/1003 KB   806/1003 KB   808/1003 KB   810/1003 KB   812/1003 KB   814/1003
KB   816/1003 KB   818/1003 KB   820/1003 KB   822/1003 KB   824/1003 KB   826/1003 KB   828/1003
KB   830/1003 KB   832/1003 KB   834/1003 KB   836/1003 KB   838/1003 KB   840/1003 KB   842/1003
KB   844/1003 KB   846/1003 KB   848/1003 KB   850/1003 KB   852/1003 KB   854/1003 KB   856/1003
KB   858/1003 KB   860/1003 KB   862/1003 KB   864/1003 KB   866/1003 KB   868/1003 KB   870/1003
KB   872/1003 KB   874/1003 KB   876/1003 KB   878/1003 KB   880/1003 KB   882/1003 KB   884/1003
KB   886/1003 KB   888/1003 KB   890/1003 KB   892/1003 KB   894/1003 KB   896/1003 KB   898/1003
KB   900/1003 KB   902/1003 KB   904/1003 KB   906/1003 KB   908/1003 KB   910/1003 KB   912/1003
KB   914/1003 KB   916/1003 KB   918/1003 KB   920/1003 KB   922/1003 KB   924/1003 KB   926/1003
KB   928/1003 KB   930/1003 KB   932/1003 KB   934/1003 KB   936/1003 KB   938/1003 KB   940/1003
KB   942/1003 KB   944/1003 KB   946/1003 KB   948/1003 KB   950/1003 KB   952/1003 KB   954/1003
KB   956/1003 KB   958/1003 KB   960/1003 KB   962/1003 KB   964/1003 KB   966/1003 KB   968/1003
KB   970/1003 KB   972/1003 KB   974/1003 KB   976/1003 KB   978/1003 KB   980/1003 KB   982/1003
KB   984/1003 KB   986/1003 KB   988/1003 KB   990/1003 KB   992/1003 KB   994/1003 KB   996/1003
KB   998/1003 KB   1000/1003 KB   1002/1003 KB   1003/1003 KB                  Uploaded: https://repository.apache.org/content/repositories/snapshots/org/apache/juneau/juneau-marshall/7.1.1-SNAPSHOT/juneau-marshall-7.1.1-20180305.143507-16.jar
(1003 KB at 888.2 KB/sec)
Uploading: https://repository.apache.org/content/repositories/snapshots/org/apache/juneau/juneau-marshall/7.1.1-SNAPSHOT/juneau-marshall-7.1.1-20180305.143507-16.pom
2/4 KB         4/4 KB            Uploaded: https://repository.apache.org/content/repositories/snapshots/org/apache/juneau/juneau-marshall/7.1.1-SNAPSHOT/juneau-marshall-7.1.1-20180305.143507-16.pom
(4 KB at 5.1 KB/sec)
Downloading: https://repository.apache.org/content/repositories/snapshots/org/apache/juneau/juneau-marshall/maven-metadata.xml
534/534 B               Downloaded: https://repository.apache.org/content/repositories/snapshots/org/apache/juneau/juneau-marshall/maven-metadata.xml
(534 B at 1.1 KB/sec)
Uploading: https://repository.apache.org/content/repositories/snapshots/org/apache/juneau/juneau-marshall/7.1.1-SNAPSHOT/maven-metadata.xml
1000/1000 B                 Uploaded: https://repository.apache.org/content/repositories/snapshots/org/apache/juneau/juneau-marshall/7.1.1-SNAPSHOT/maven-metadata.xml
(1000 B at 1.4 KB/sec)
Uploading: https://repository.apache.org/content/repositories/snapshots/org/apache/juneau/juneau-marshall/maven-metadata.xml
534/534 B                 Uploaded: https://repository.apache.org/content/repositories/snapshots/org/apache/juneau/juneau-marshall/maven-metadata.xml
(534 B at 0.8 KB/sec)
Uploading: https://repository.apache.org/content/repositories/snapshots/org/apache/juneau/juneau-marshall/7.1.1-SNAPSHOT/juneau-marshall-7.1.1-20180305.143507-16-sources.jar
Mar 05, 2018 2:35:11 PM org.apache.maven.wagon.providers.http.httpclient.impl.execchain.RetryExec
execute
INFO: I/O exception (java.io.FileNotFoundException) caught when processing request to {s}->https://repository.apache.org:443:
<https://builds.apache.org/job/Juneau-Java-1.8/ws/juneau-core/juneau-marshall/target/juneau-marshall-7.1.1-SNAPSHOT-sources.jar>
(No such file or directory)
Mar 05, 2018 2:35:11 PM org.apache.maven.wagon.providers.http.httpclient.impl.execchain.RetryExec
execute
INFO: Retrying request to {s}->https://repository.apache.org:443
Mar 05, 2018 2:35:11 PM org.apache.maven.wagon.providers.http.httpclient.impl.execchain.RetryExec
execute
INFO: I/O exception (java.io.FileNotFoundException) caught when processing request to {s}->https://repository.apache.org:443:
<https://builds.apache.org/job/Juneau-Java-1.8/ws/juneau-core/juneau-marshall/target/juneau-marshall-7.1.1-SNAPSHOT-sources.jar>
(No such file or directory)
Mar 05, 2018 2:35:11 PM org.apache.maven.wagon.providers.http.httpclient.impl.execchain.RetryExec
execute
INFO: Retrying request to {s}->https://repository.apache.org:443
Mar 05, 2018 2:35:12 PM org.apache.maven.wagon.providers.http.httpclient.impl.execchain.RetryExec
execute
INFO: I/O exception (java.io.FileNotFoundException) caught when processing request to {s}->https://repository.apache.org:443:
<https://builds.apache.org/job/Juneau-Java-1.8/ws/juneau-core/juneau-marshall/target/juneau-marshall-7.1.1-SNAPSHOT-sources.jar>
(No such file or directory)
Mar 05, 2018 2:35:12 PM org.apache.maven.wagon.providers.http.httpclient.impl.execchain.RetryExec
execute
INFO: Retrying request to {s}->https://repository.apache.org:443
            [INFO] ------------------------------------------------------------------------
[INFO] Reactor Summary:
[INFO] 
[INFO] Apache Juneau ...................................... SUCCESS [  6.660 s]
[INFO] Apache Juneau - Core APIs .......................... SUCCESS [  3.294 s]
[INFO] Apache Juneau Marshall ............................. FAILURE [ 25.066 s]
[INFO] Apache Juneau Marshal RDF .......................... SKIPPED
[INFO] Apache Juneau Data Transfer Objects ................ SKIPPED
[INFO] Apache Juneau Core ................................. SKIPPED
[INFO] Apache Juneau Config File API ...................... SKIPPED
[INFO] Apache Juneau Core Tests ........................... SKIPPED
[INFO] Apache Juneau - REST APIs .......................... SKIPPED
[INFO] Apache Juneau REST Servlet API ..................... SKIPPED
[INFO] Apache Juneau REST JAX/RS API ...................... SKIPPED
[INFO] Apache Juneau REST Client API ...................... SKIPPED
[INFO] Apache Juneau - Microservice APIs .................. SKIPPED
[INFO] Apache Juneau Microservice Server .................. SKIPPED
[INFO] Apache Juneau Microservice Template ................ SKIPPED
[INFO] Apache Juneau - Examples ........................... SKIPPED
[INFO] Apache Juneau REST Examples ........................ SKIPPED
[INFO] Apache Juneau Microservice Tests ................... SKIPPED
[INFO] Apache Juneau Core Examples ........................ SKIPPED
[INFO] Apache Juneau Javadocs ............................. SKIPPED
[INFO] Apache Juneau - Release Engineering ................ SKIPPED
[INFO] Apache Juneau UberJar .............................. SKIPPED
[INFO] Apache Juneau Distribution ......................... SKIPPED
[INFO] ------------------------------------------------------------------------
[INFO] BUILD FAILURE
[INFO] ------------------------------------------------------------------------
[INFO] Total time: 36.128 s
[INFO] Finished at: 2018-03-05T14:35:12+00:00
[INFO] Final Memory: 56M/1482M
[INFO] ------------------------------------------------------------------------
[ERROR] Failed to execute goal org.apache.maven.plugins:maven-deploy-plugin:2.8.2:deploy (default-deploy)
on project juneau-marshall: Failed to deploy artifacts: Could not transfer artifact org.apache.juneau:juneau-marshall:jar:sources:7.1.1-20180305.143507-16
from/to apache.snapshots.https (https://repository.apache.org/content/repositories/snapshots):
<https://builds.apache.org/job/Juneau-Java-1.8/ws/juneau-core/juneau-marshall/target/juneau-marshall-7.1.1-SNAPSHOT-sources.jar>
(No such file or directory) -> [Help 1]
[ERROR] 
[ERROR] To see the full stack trace of the errors, re-run Maven with the -e switch.
[ERROR] Re-run Maven using the -X switch to enable full debug logging.
[ERROR] 
[ERROR] For more information about the errors and possible solutions, please read the following
articles:
[ERROR] [Help 1] http://cwiki.apache.org/confluence/display/MAVEN/MojoExecutionException
[ERROR] 
[ERROR] After correcting the problems, you can resume the build with the command
[ERROR]   mvn <goals> -rf :juneau-marshall
Build step 'Invoke top-level Maven targets' marked build as failure

Mime
View raw message