juneau-dev mailing list archives

Site index · List index
Message view « Date » · « Thread »
Top « Date » · « Thread »
From Apache Jenkins Server <jenk...@builds.apache.org>
Subject Build failed in Jenkins: Juneau-Java-1.8 #726
Date Mon, 05 Mar 2018 14:32:36 GMT
See <https://builds.apache.org/job/Juneau-Java-1.8/726/display/redirect?page=changes>

Changes:

[JamesBognar] Fix build failure.

------------------------------------------
[...truncated 321.43 KB...]
[INFO] 
[INFO] --- apache-rat-plugin:0.11:check (default) @ juneau-examples ---
[INFO] 53 implicit excludes (use -debug for more details).
[INFO] Exclude: **/DEPENDENCIES
[INFO] Exclude: **/target/**
[INFO] Exclude: **/.settings/**
[INFO] Exclude: **/.project
[INFO] Exclude: **/.classpath
[INFO] Exclude: **/*.launch
[INFO] Exclude: **/jetty.out.xml
[INFO] Exclude: **/dependency-reduced-pom.xml
[INFO] 1 resources included (use -debug for more details)
[INFO] Rat check: Summary of files. Unapproved: 0 unknown: 0 generated: 0 approved: 1 licence.
[INFO] 
[INFO] --- maven-install-plugin:2.5.2:install (default-install) @ juneau-examples ---
[INFO] Installing <https://builds.apache.org/job/Juneau-Java-1.8/ws/juneau-examples/pom.xml>
to /home/jenkins/.m2/repository/org/apache/juneau/juneau-examples/7.1.1-SNAPSHOT/juneau-examples-7.1.1-SNAPSHOT.pom
[INFO] 
[INFO] --- maven-enforcer-plugin:1.4.1:enforce (enforce-maven) @ juneau-examples ---
[INFO] 
[INFO] --- maven-remote-resources-plugin:1.5:process (process-resource-bundles) @ juneau-examples
---
[INFO] 
[INFO] --- maven-site-plugin:3.5.1:attach-descriptor (attach-descriptor) @ juneau-examples
---
[INFO] 
[INFO] --- apache-rat-plugin:0.11:check (default) @ juneau-examples ---
[INFO] 53 implicit excludes (use -debug for more details).
[INFO] Exclude: **/DEPENDENCIES
[INFO] Exclude: **/target/**
[INFO] Exclude: **/.settings/**
[INFO] Exclude: **/.project
[INFO] Exclude: **/.classpath
[INFO] Exclude: **/*.launch
[INFO] Exclude: **/jetty.out.xml
[INFO] Exclude: **/dependency-reduced-pom.xml
[INFO] 1 resources included (use -debug for more details)
[INFO] Rat check: Summary of files. Unapproved: 0 unknown: 0 generated: 0 approved: 1 licence.
[INFO] 
[INFO] --- maven-install-plugin:2.5.2:install (default-install) @ juneau-examples ---
[INFO] Installing <https://builds.apache.org/job/Juneau-Java-1.8/ws/juneau-examples/pom.xml>
to /home/jenkins/.m2/repository/org/apache/juneau/juneau-examples/7.1.1-SNAPSHOT/juneau-examples-7.1.1-SNAPSHOT.pom
[INFO] 
[INFO] --- maven-deploy-plugin:2.8.2:deploy (default-deploy) @ juneau-examples ---
Downloading: https://repository.apache.org/content/repositories/snapshots/org/apache/juneau/juneau-examples/7.1.1-SNAPSHOT/maven-metadata.xml
611/611 B                 Downloaded: https://repository.apache.org/content/repositories/snapshots/org/apache/juneau/juneau-examples/7.1.1-SNAPSHOT/maven-metadata.xml
(611 B at 1.3 KB/sec)
Uploading: https://repository.apache.org/content/repositories/snapshots/org/apache/juneau/juneau-examples/7.1.1-SNAPSHOT/juneau-examples-7.1.1-20180305.143220-15.pom
2/3 KB      3/3 KB            Uploaded: https://repository.apache.org/content/repositories/snapshots/org/apache/juneau/juneau-examples/7.1.1-SNAPSHOT/juneau-examples-7.1.1-20180305.143220-15.pom
(3 KB at 3.1 KB/sec)
Downloading: https://repository.apache.org/content/repositories/snapshots/org/apache/juneau/juneau-examples/maven-metadata.xml
585/585 B               Downloaded: https://repository.apache.org/content/repositories/snapshots/org/apache/juneau/juneau-examples/maven-metadata.xml
(585 B at 1.2 KB/sec)
Uploading: https://repository.apache.org/content/repositories/snapshots/org/apache/juneau/juneau-examples/7.1.1-SNAPSHOT/maven-metadata.xml
611/611 B               Uploaded: https://repository.apache.org/content/repositories/snapshots/org/apache/juneau/juneau-examples/7.1.1-SNAPSHOT/maven-metadata.xml
(611 B at 0.9 KB/sec)
Uploading: https://repository.apache.org/content/repositories/snapshots/org/apache/juneau/juneau-examples/maven-metadata.xml
585/585 B               Uploaded: https://repository.apache.org/content/repositories/snapshots/org/apache/juneau/juneau-examples/maven-metadata.xml
(585 B at 0.8 KB/sec)
[INFO]                                                                         
[INFO] ------------------------------------------------------------------------
[INFO] Building Apache Juneau REST Examples 7.1.1-SNAPSHOT
[INFO] ------------------------------------------------------------------------
[INFO] 
[INFO] --- maven-clean-plugin:3.0.0:clean (default-clean) @ juneau-examples-rest ---
[INFO] Deleting <https://builds.apache.org/job/Juneau-Java-1.8/ws/juneau-examples/juneau-examples-rest/target>
[INFO] 
[INFO] --- maven-enforcer-plugin:1.4.1:enforce (enforce-maven) @ juneau-examples-rest ---
[INFO] 
[INFO] --- maven-remote-resources-plugin:1.5:process (process-resource-bundles) @ juneau-examples-rest
---
[INFO] 
[INFO] --- maven-resources-plugin:2.7:resources (default-resources) @ juneau-examples-rest
---
[INFO] Using 'UTF-8' encoding to copy filtered resources.
[INFO] Copying 18 resources
[INFO] Copying 3 resources
[INFO] 
[INFO] --- maven-compiler-plugin:3.5.1:compile (default-compile) @ juneau-examples-rest ---
[INFO] Changes detected - recompiling the module!
[INFO] Compiling 29 source files to <https://builds.apache.org/job/Juneau-Java-1.8/ws/juneau-examples/juneau-examples-rest/target/classes>
[INFO] 
[INFO] --- maven-resources-plugin:2.7:testResources (default-testResources) @ juneau-examples-rest
---
[INFO] Using 'UTF-8' encoding to copy filtered resources.
[INFO] skip non existing resourceDirectory <https://builds.apache.org/job/Juneau-Java-1.8/ws/juneau-examples/juneau-examples-rest/src/test/resources>
[INFO] Copying 3 resources
[INFO] 
[INFO] --- maven-compiler-plugin:3.5.1:testCompile (default-testCompile) @ juneau-examples-rest
---
[INFO] Changes detected - recompiling the module!
[INFO] Compiling 10 source files to <https://builds.apache.org/job/Juneau-Java-1.8/ws/juneau-examples/juneau-examples-rest/target/test-classes>
[INFO] 
[INFO] --- maven-surefire-plugin:2.19.1:test (default-test) @ juneau-examples-rest ---

-------------------------------------------------------
 T E S T S
-------------------------------------------------------
Running org.apache.juneau.examples.rest._TestSuite
Running class 'RestMicroservice' using config file 'examples.cfg'.
Server started on port 10000

List of available commands:
	exit -- Shut down service
	restart -- Restarts service
	help -- Commands help
	echo -- Echo command

> log4j:WARN No appenders could be found for logger (org.apache.http.client.protocol.RequestAddCookies).
log4j:WARN Please initialize the log4j system properly.
log4j:WARN See http://logging.apache.org/log4j/1.2/faq.html#noconfig for more info.
Warning: org.apache.xerces.jaxp.SAXParserImpl$JAXPSAXParser: Property 'http://www.oracle.com/xml/jaxp/properties/entityExpansionLimit'
is not recognized.
Compiler warnings:
  WARNING:  'org.apache.xerces.jaxp.SAXParserImpl: Property 'http://javax.xml.XMLConstants/property/accessExternalDTD'
is not recognized.'
WARNING:  RestClient garbage collected before it was finalized.
Creation stack traces can be displayed by setting the system property 'org.apache.juneau.rest.client.RestClient.trackLifecycle'
to true.
Stopping server.
Server stopped.
Tests run: 31, Failures: 0, Errors: 0, Skipped: 0, Time elapsed: 5.467 sec - in org.apache.juneau.examples.rest._TestSuite
[JsonSchemaSerializer] = [2,1,33%]
[PlainTextParser] = [1,3,75%]
[Config] = [23,0,0%]
[UrlEncodingSerializer] = [4,25,86%]
[SoapXmlSerializer] = [2,1,33%]
[JsonSerializer] = [8,8,50%]
[Simple] = [2,1,33%]
[HtmlDocSerializer] = [2,1,33%]
[UrlEncodingParser] = [2,1,33%]
[UonPartParser] = [1,3,75%]
[ImageParser] = [1,1,50%]
[HtmlStrippedDocSerializer] = [2,1,33%]
[MsgPackSerializer] = [2,3,60%]
[JsonParser] = [2,7,77%]
[UonSerializer] = [3,2,40%]
[XmlParser] = [2,4,66%]
[Turtle] = [2,0,0%]
[MsgPackParser] = [1,3,75%]
[N3] = [2,0,0%]
[PlainTextSerializer] = [2,3,60%]
[XmlDocSerializer] = [2,1,33%]
[UonParser] = [2,2,50%]
[ImageSerializer] = [1,0,0%]
[XmlSchemaDocSerializer] = [2,1,33%]
[HtmlSchemaDocSerializer] = [2,1,33%]
[RdfSerializer] = [4,0,0%]
[BeanContext] = [4,24,85%]
[HtmlParser] = [2,4,66%]
[HtmlSerializer] = [2,0,0%]
[Xml] = [2,0,0%]
[NTriple] = [2,0,0%]
[XmlAbbrev] = [1,0,0%]
[XmlSerializer] = [2,2,50%]
[RdfParser] = [4,0,0%]
[total] = [98,103,51%]

Results :

Tests run: 31, Failures: 0, Errors: 0, Skipped: 0

[INFO] 
[INFO] --- maven-jar-plugin:3.0.0:jar (default-jar) @ juneau-examples-rest ---
[INFO] Building jar: <https://builds.apache.org/job/Juneau-Java-1.8/ws/juneau-examples/juneau-examples-rest/target/juneau-examples-rest-7.1.1-SNAPSHOT.jar>
[INFO] 
[INFO] --- maven-site-plugin:3.5.1:attach-descriptor (attach-descriptor) @ juneau-examples-rest
---
[INFO] 
[INFO] --- maven-shade-plugin:2.4.3:shade (default) @ juneau-examples-rest ---
[INFO] Including org.apache.juneau:juneau-microservice-server:jar:7.1.1-SNAPSHOT in the shaded
jar.
[INFO] Including org.apache.juneau:juneau-rest-server:jar:7.1.1-SNAPSHOT in the shaded jar.
[INFO] Including org.apache.juneau:juneau-marshall:jar:7.1.1-SNAPSHOT in the shaded jar.
[INFO] Including org.apache.juneau:juneau-config:jar:7.1.1-SNAPSHOT in the shaded jar.
[INFO] Including org.apache.juneau:juneau-svl:jar:7.1.1-SNAPSHOT in the shaded jar.
[INFO] Including org.apache.juneau:juneau-dto:jar:7.1.1-SNAPSHOT in the shaded jar.
[INFO] Including org.apache.juneau:juneau-rest-client:jar:7.1.1-SNAPSHOT in the shaded jar.
[INFO] Including org.apache.juneau:juneau-marshall-rdf:jar:7.1.1-SNAPSHOT in the shaded jar.
[INFO] Including org.eclipse.jetty:jetty-server:jar:9.4.8.v20171121 in the shaded jar.
[INFO] Including org.eclipse.jetty:jetty-http:jar:9.4.8.v20171121 in the shaded jar.
[INFO] Including org.eclipse.jetty:jetty-io:jar:9.4.8.v20171121 in the shaded jar.
[INFO] Including org.eclipse.jetty:jetty-security:jar:9.4.8.v20171121 in the shaded jar.
[INFO] Including org.eclipse.jetty:jetty-servlet:jar:9.4.8.v20171121 in the shaded jar.
[INFO] Including org.eclipse.jetty:jetty-xml:jar:9.4.8.v20171121 in the shaded jar.
[INFO] Including org.eclipse.jetty:jetty-util:jar:9.4.8.v20171121 in the shaded jar.
[INFO] Including org.apache.jena:jena-core:jar:2.7.1 in the shaded jar.
[INFO] Including org.apache.jena:jena-iri:jar:0.9.1 in the shaded jar.
[INFO] Including xerces:xercesImpl:jar:2.10.0 in the shaded jar.
[INFO] Including xml-apis:xml-apis:jar:1.4.01 in the shaded jar.
[INFO] Including org.slf4j:slf4j-api:jar:1.6.4 in the shaded jar.
[INFO] Including org.slf4j:slf4j-log4j12:jar:1.6.4 in the shaded jar.
[INFO] Including log4j:log4j:jar:1.2.16 in the shaded jar.
[INFO] Including org.apache.derby:derby:jar:10.10.2.0 in the shaded jar.
[INFO] Including commons-fileupload:commons-fileupload:jar:1.3.1 in the shaded jar.
[INFO] Including commons-io:commons-io:jar:2.2 in the shaded jar.
[INFO] Including org.apache.httpcomponents:httpmime:jar:4.5.4 in the shaded jar.
[INFO] Including org.apache.httpcomponents:httpclient:jar:4.5.4 in the shaded jar.
[INFO] Including org.apache.httpcomponents:httpcore:jar:4.4.7 in the shaded jar.
[INFO] Including commons-logging:commons-logging:jar:1.2 in the shaded jar.
[INFO] Including commons-codec:commons-codec:jar:1.10 in the shaded jar.
[INFO] Replacing original artifact with shaded artifact.
[INFO] Replacing <https://builds.apache.org/job/Juneau-Java-1.8/ws/juneau-examples/juneau-examples-rest/target/juneau-examples-rest-7.1.1-SNAPSHOT.jar>
with <https://builds.apache.org/job/Juneau-Java-1.8/ws/juneau-examples/juneau-examples-rest/target/juneau-examples-rest-7.1.1-SNAPSHOT-shaded.jar>
[INFO] 
[INFO] --- build-helper-maven-plugin:1.12:attach-artifact (attach-artifacts) @ juneau-examples-rest
---
[INFO] 
[INFO] --- maven-assembly-plugin:2.6:single (juneau-assembly) @ juneau-examples-rest ---
[INFO] Reading assembly descriptor: src/assembly/bin.xml
[WARNING] The assembly descriptor contains a filesystem-root relative reference, which is
not cross platform compatible /
[INFO] Building zip: <https://builds.apache.org/job/Juneau-Java-1.8/ws/juneau-examples/juneau-examples-rest/target/juneau-examples-rest-7.1.1-SNAPSHOT-bin.zip>
[INFO] 
[INFO] --- apache-rat-plugin:0.11:check (default) @ juneau-examples-rest ---
[INFO] 51 implicit excludes (use -debug for more details).
[INFO] Exclude: **/DEPENDENCIES
[INFO] Exclude: **/target/**
[INFO] Exclude: **/.settings/**
[INFO] Exclude: **/.project
[INFO] Exclude: **/.classpath
[INFO] Exclude: **/*.launch
[INFO] Exclude: **/jetty.out.xml
[INFO] Exclude: **/dependency-reduced-pom.xml
[INFO] 67 resources included (use -debug for more details)
[INFO] Rat check: Summary of files. Unapproved: 3 unknown: 3 generated: 0 approved: 53 licence.
[INFO] ------------------------------------------------------------------------
[INFO] Reactor Summary:
[INFO] 
[INFO] Apache Juneau ...................................... SUCCESS [  8.179 s]
[INFO] Apache Juneau - Core APIs .......................... SUCCESS [  3.399 s]
[INFO] Apache Juneau Marshall ............................. SUCCESS [ 31.094 s]
[INFO] Apache Juneau Marshal RDF .......................... SUCCESS [ 10.553 s]
[INFO] Apache Juneau Data Transfer Objects ................ SUCCESS [ 13.449 s]
[INFO] Apache Juneau Core ................................. SUCCESS [  9.149 s]
[INFO] Apache Juneau Config File API ...................... SUCCESS [ 10.055 s]
[INFO] Apache Juneau Core Tests ........................... SUCCESS [ 39.127 s]
[INFO] Apache Juneau - REST APIs .......................... SUCCESS [  3.354 s]
[INFO] Apache Juneau REST Servlet API ..................... SUCCESS [ 12.950 s]
[INFO] Apache Juneau REST JAX/RS API ...................... SUCCESS [  8.861 s]
[INFO] Apache Juneau REST Client API ...................... SUCCESS [  9.987 s]
[INFO] Apache Juneau - Microservice APIs .................. SUCCESS [  3.420 s]
[INFO] Apache Juneau Microservice Server .................. SUCCESS [ 10.305 s]
[INFO] Apache Juneau Microservice Template ................ SUCCESS [  8.692 s]
[INFO] Apache Juneau - Examples ........................... SUCCESS [  3.347 s]
[INFO] Apache Juneau REST Examples ........................ FAILURE [ 10.475 s]
[INFO] Apache Juneau Microservice Tests ................... SKIPPED
[INFO] Apache Juneau Core Examples ........................ SKIPPED
[INFO] Apache Juneau Javadocs ............................. SKIPPED
[INFO] Apache Juneau - Release Engineering ................ SKIPPED
[INFO] Apache Juneau UberJar .............................. SKIPPED
[INFO] Apache Juneau Distribution ......................... SKIPPED
[INFO] ------------------------------------------------------------------------
[INFO] BUILD FAILURE
[INFO] ------------------------------------------------------------------------
[INFO] Total time: 03:17 min
[INFO] Finished at: 2018-03-05T14:32:33+00:00
[INFO] Final Memory: 138M/3904M
[INFO] ------------------------------------------------------------------------
[ERROR] Failed to execute goal org.apache.rat:apache-rat-plugin:0.11:check (default) on project
juneau-examples-rest: Too many files with unapproved license: 3 See RAT report in: <https://builds.apache.org/job/Juneau-Java-1.8/ws/juneau-examples/juneau-examples-rest/target/rat.txt>
-> [Help 1]
[ERROR] 
[ERROR] To see the full stack trace of the errors, re-run Maven with the -e switch.
[ERROR] Re-run Maven using the -X switch to enable full debug logging.
[ERROR] 
[ERROR] For more information about the errors and possible solutions, please read the following
articles:
[ERROR] [Help 1] http://cwiki.apache.org/confluence/display/MAVEN/MojoFailureException
[ERROR] 
[ERROR] After correcting the problems, you can resume the build with the command
[ERROR]   mvn <goals> -rf :juneau-examples-rest
Build step 'Invoke top-level Maven targets' marked build as failure

Mime
View raw message