juneau-dev mailing list archives

Site index · List index
Message view « Date » · « Thread »
Top « Date » · « Thread »
From Apache Jenkins Server <jenk...@builds.apache.org>
Subject Build failed in Jenkins: Juneau-Java-1.8 #637
Date Mon, 01 Jan 2018 19:37:27 GMT
See <https://builds.apache.org/job/Juneau-Java-1.8/637/display/redirect?page=changes>

Changes:

[JamesBognar] RestCall should extend BeanSession.

------------------------------------------
[...truncated 326.79 KB...]
[INFO] Exclude: **/*.launch
[INFO] Exclude: **/jetty.out.xml
[INFO] Exclude: **/dependency-reduced-pom.xml
[INFO] 10 resources included (use -debug for more details)
[INFO] Rat check: Summary of files. Unapproved: 0 unknown: 0 generated: 0 approved: 10 licence.
[INFO] 
[INFO] --- maven-install-plugin:2.5.2:install (default-install) @ juneau-microservice-template
---
[INFO] Installing <https://builds.apache.org/job/Juneau-Java-1.8/ws/juneau-microservice/juneau-microservice-template/target/juneau-microservice-template-7.0.2-SNAPSHOT.jar>
to /home/jenkins/.m2/repository/org/apache/juneau/juneau-microservice-template/7.0.2-SNAPSHOT/juneau-microservice-template-7.0.2-SNAPSHOT.jar
[INFO] Installing <https://builds.apache.org/job/Juneau-Java-1.8/ws/juneau-microservice/juneau-microservice-template/pom.xml>
to /home/jenkins/.m2/repository/org/apache/juneau/juneau-microservice-template/7.0.2-SNAPSHOT/juneau-microservice-template-7.0.2-SNAPSHOT.pom
[INFO] Installing <https://builds.apache.org/job/Juneau-Java-1.8/ws/juneau-microservice/juneau-microservice-template/target/my-microservice-7.0.2-SNAPSHOT-bin.zip>
to /home/jenkins/.m2/repository/org/apache/juneau/juneau-microservice-template/7.0.2-SNAPSHOT/juneau-microservice-template-7.0.2-SNAPSHOT-bin.zip
[INFO] Installing <https://builds.apache.org/job/Juneau-Java-1.8/ws/juneau-microservice/juneau-microservice-template/target/my-microservice-7.0.2-SNAPSHOT-bin.zip>
to /home/jenkins/.m2/repository/org/apache/juneau/juneau-microservice-template/7.0.2-SNAPSHOT/juneau-microservice-template-7.0.2-SNAPSHOT-bin.zip
[INFO] 
[INFO] --- maven-deploy-plugin:2.8.2:deploy (default-deploy) @ juneau-microservice-template
---
Downloading: https://repository.apache.org/content/repositories/snapshots/org/apache/juneau/juneau-microservice-template/7.0.2-SNAPSHOT/maven-metadata.xml
1009/1009 B                 Downloaded: https://repository.apache.org/content/repositories/snapshots/org/apache/juneau/juneau-microservice-template/7.0.2-SNAPSHOT/maven-metadata.xml
(1009 B at 1.6 KB/sec)
Uploading: https://repository.apache.org/content/repositories/snapshots/org/apache/juneau/juneau-microservice-template/7.0.2-SNAPSHOT/juneau-microservice-template-7.0.2-20180101.193654-48.jar
2/10 KB       4/10 KB   6/10 KB   8/10 KB   10/10 KB              Uploaded: https://repository.apache.org/content/repositories/snapshots/org/apache/juneau/juneau-microservice-template/7.0.2-SNAPSHOT/juneau-microservice-template-7.0.2-20180101.193654-48.jar
(10 KB at 14.0 KB/sec)
Uploading: https://repository.apache.org/content/repositories/snapshots/org/apache/juneau/juneau-microservice-template/7.0.2-SNAPSHOT/juneau-microservice-template-7.0.2-20180101.193654-48.pom
2/4 KB     4/4 KB            Uploaded: https://repository.apache.org/content/repositories/snapshots/org/apache/juneau/juneau-microservice-template/7.0.2-SNAPSHOT/juneau-microservice-template-7.0.2-20180101.193654-48.pom
(4 KB at 5.0 KB/sec)
Downloading: https://repository.apache.org/content/repositories/snapshots/org/apache/juneau/juneau-microservice-template/maven-metadata.xml
467/467 B               Downloaded: https://repository.apache.org/content/repositories/snapshots/org/apache/juneau/juneau-microservice-template/maven-metadata.xml
(467 B at 1.0 KB/sec)
Uploading: https://repository.apache.org/content/repositories/snapshots/org/apache/juneau/juneau-microservice-template/7.0.2-SNAPSHOT/maven-metadata.xml
1009/1009 B                 Uploaded: https://repository.apache.org/content/repositories/snapshots/org/apache/juneau/juneau-microservice-template/7.0.2-SNAPSHOT/maven-metadata.xml
(1009 B at 1.4 KB/sec)
Uploading: https://repository.apache.org/content/repositories/snapshots/org/apache/juneau/juneau-microservice-template/maven-metadata.xml
467/467 B                 Uploaded: https://repository.apache.org/content/repositories/snapshots/org/apache/juneau/juneau-microservice-template/maven-metadata.xml
(467 B at 0.6 KB/sec)
Uploading: https://repository.apache.org/content/repositories/snapshots/org/apache/juneau/juneau-microservice-template/7.0.2-SNAPSHOT/juneau-microservice-template-7.0.2-20180101.193654-48-bin.zip
2/19 KB     4/19 KB   6/19 KB   8/19 KB   10/19 KB   12/19 KB   14/19 KB   16/19 KB   18/19
KB   19/19 KB              Uploaded: https://repository.apache.org/content/repositories/snapshots/org/apache/juneau/juneau-microservice-template/7.0.2-SNAPSHOT/juneau-microservice-template-7.0.2-20180101.193654-48-bin.zip
(19 KB at 24.6 KB/sec)
Uploading: https://repository.apache.org/content/repositories/snapshots/org/apache/juneau/juneau-microservice-template/7.0.2-SNAPSHOT/maven-metadata.xml
1009/1009 B                 Uploaded: https://repository.apache.org/content/repositories/snapshots/org/apache/juneau/juneau-microservice-template/7.0.2-SNAPSHOT/maven-metadata.xml
(1009 B at 1.4 KB/sec)
Uploading: https://repository.apache.org/content/repositories/snapshots/org/apache/juneau/juneau-microservice-template/7.0.2-SNAPSHOT/juneau-microservice-template-7.0.2-20180101.193654-48-bin.zip
2/19 KB       4/19 KB   6/19 KB   8/19 KB   10/19 KB   12/19 KB   14/19 KB   16/19 KB   18/19
KB   19/19 KB              Uploaded: https://repository.apache.org/content/repositories/snapshots/org/apache/juneau/juneau-microservice-template/7.0.2-SNAPSHOT/juneau-microservice-template-7.0.2-20180101.193654-48-bin.zip
(19 KB at 24.1 KB/sec)
Uploading: https://repository.apache.org/content/repositories/snapshots/org/apache/juneau/juneau-microservice-template/7.0.2-SNAPSHOT/maven-metadata.xml
1009/1009 B                 Uploaded: https://repository.apache.org/content/repositories/snapshots/org/apache/juneau/juneau-microservice-template/7.0.2-SNAPSHOT/maven-metadata.xml
(1009 B at 1.4 KB/sec)
[INFO]                                                                         
[INFO] ------------------------------------------------------------------------
[INFO] Building Apache Juneau - Examples 7.0.2-SNAPSHOT
[INFO] ------------------------------------------------------------------------
[INFO] 
[INFO] --- maven-clean-plugin:3.0.0:clean (default-clean) @ juneau-examples ---
[INFO] Deleting <https://builds.apache.org/job/Juneau-Java-1.8/ws/juneau-examples/target>
[INFO] 
[INFO] --- maven-enforcer-plugin:1.4.1:enforce (enforce-maven) @ juneau-examples ---
[INFO] 
[INFO] --- maven-remote-resources-plugin:1.5:process (process-resource-bundles) @ juneau-examples
---
[INFO] 
[INFO] --- maven-site-plugin:3.5.1:attach-descriptor (attach-descriptor) @ juneau-examples
---
[INFO] 
[INFO] --- apache-rat-plugin:0.11:check (default) @ juneau-examples ---
[INFO] 53 implicit excludes (use -debug for more details).
[INFO] Exclude: **/DEPENDENCIES
[INFO] Exclude: **/target/**
[INFO] Exclude: **/.settings/**
[INFO] Exclude: **/.project
[INFO] Exclude: **/.classpath
[INFO] Exclude: **/*.launch
[INFO] Exclude: **/jetty.out.xml
[INFO] Exclude: **/dependency-reduced-pom.xml
[INFO] 1 resources included (use -debug for more details)
[INFO] Rat check: Summary of files. Unapproved: 0 unknown: 0 generated: 0 approved: 1 licence.
[INFO] 
[INFO] --- maven-install-plugin:2.5.2:install (default-install) @ juneau-examples ---
[INFO] Installing <https://builds.apache.org/job/Juneau-Java-1.8/ws/juneau-examples/pom.xml>
to /home/jenkins/.m2/repository/org/apache/juneau/juneau-examples/7.0.2-SNAPSHOT/juneau-examples-7.0.2-SNAPSHOT.pom
[INFO] 
[INFO] --- maven-enforcer-plugin:1.4.1:enforce (enforce-maven) @ juneau-examples ---
[INFO] 
[INFO] --- maven-remote-resources-plugin:1.5:process (process-resource-bundles) @ juneau-examples
---
[INFO] 
[INFO] --- maven-site-plugin:3.5.1:attach-descriptor (attach-descriptor) @ juneau-examples
---
[INFO] 
[INFO] --- apache-rat-plugin:0.11:check (default) @ juneau-examples ---
[INFO] 53 implicit excludes (use -debug for more details).
[INFO] Exclude: **/DEPENDENCIES
[INFO] Exclude: **/target/**
[INFO] Exclude: **/.settings/**
[INFO] Exclude: **/.project
[INFO] Exclude: **/.classpath
[INFO] Exclude: **/*.launch
[INFO] Exclude: **/jetty.out.xml
[INFO] Exclude: **/dependency-reduced-pom.xml
[INFO] 1 resources included (use -debug for more details)
[INFO] Rat check: Summary of files. Unapproved: 0 unknown: 0 generated: 0 approved: 1 licence.
[INFO] 
[INFO] --- maven-install-plugin:2.5.2:install (default-install) @ juneau-examples ---
[INFO] Installing <https://builds.apache.org/job/Juneau-Java-1.8/ws/juneau-examples/pom.xml>
to /home/jenkins/.m2/repository/org/apache/juneau/juneau-examples/7.0.2-SNAPSHOT/juneau-examples-7.0.2-SNAPSHOT.pom
[INFO] 
[INFO] --- maven-deploy-plugin:2.8.2:deploy (default-deploy) @ juneau-examples ---
Downloading: https://repository.apache.org/content/repositories/snapshots/org/apache/juneau/juneau-examples/7.0.2-SNAPSHOT/maven-metadata.xml
611/611 B                 Downloaded: https://repository.apache.org/content/repositories/snapshots/org/apache/juneau/juneau-examples/7.0.2-SNAPSHOT/maven-metadata.xml
(611 B at 1.3 KB/sec)
Uploading: https://repository.apache.org/content/repositories/snapshots/org/apache/juneau/juneau-examples/7.0.2-SNAPSHOT/juneau-examples-7.0.2-20180101.193701-48.pom
2/3 KB      3/3 KB            Uploaded: https://repository.apache.org/content/repositories/snapshots/org/apache/juneau/juneau-examples/7.0.2-SNAPSHOT/juneau-examples-7.0.2-20180101.193701-48.pom
(3 KB at 3.0 KB/sec)
Downloading: https://repository.apache.org/content/repositories/snapshots/org/apache/juneau/juneau-examples/maven-metadata.xml
505/505 B               Downloaded: https://repository.apache.org/content/repositories/snapshots/org/apache/juneau/juneau-examples/maven-metadata.xml
(505 B at 1.1 KB/sec)
Uploading: https://repository.apache.org/content/repositories/snapshots/org/apache/juneau/juneau-examples/7.0.2-SNAPSHOT/maven-metadata.xml
611/611 B               Uploaded: https://repository.apache.org/content/repositories/snapshots/org/apache/juneau/juneau-examples/7.0.2-SNAPSHOT/maven-metadata.xml
(611 B at 0.8 KB/sec)
Uploading: https://repository.apache.org/content/repositories/snapshots/org/apache/juneau/juneau-examples/maven-metadata.xml
505/505 B               Uploaded: https://repository.apache.org/content/repositories/snapshots/org/apache/juneau/juneau-examples/maven-metadata.xml
(505 B at 0.7 KB/sec)
[INFO]                                                                         
[INFO] ------------------------------------------------------------------------
[INFO] Building Apache Juneau REST Examples 7.0.2-SNAPSHOT
[INFO] ------------------------------------------------------------------------
[INFO] 
[INFO] --- maven-clean-plugin:3.0.0:clean (default-clean) @ juneau-examples-rest ---
[INFO] Deleting <https://builds.apache.org/job/Juneau-Java-1.8/ws/juneau-examples/juneau-examples-rest/target>
[INFO] 
[INFO] --- maven-enforcer-plugin:1.4.1:enforce (enforce-maven) @ juneau-examples-rest ---
[INFO] 
[INFO] --- maven-remote-resources-plugin:1.5:process (process-resource-bundles) @ juneau-examples-rest
---
[INFO] 
[INFO] --- maven-resources-plugin:2.7:resources (default-resources) @ juneau-examples-rest
---
[INFO] Using 'UTF-8' encoding to copy filtered resources.
[INFO] Copying 18 resources
[INFO] Copying 3 resources
[INFO] 
[INFO] --- maven-compiler-plugin:3.5.1:compile (default-compile) @ juneau-examples-rest ---
[INFO] Changes detected - recompiling the module!
[INFO] Compiling 28 source files to <https://builds.apache.org/job/Juneau-Java-1.8/ws/juneau-examples/juneau-examples-rest/target/classes>
[INFO] 
[INFO] --- maven-resources-plugin:2.7:testResources (default-testResources) @ juneau-examples-rest
---
[INFO] Using 'UTF-8' encoding to copy filtered resources.
[INFO] skip non existing resourceDirectory <https://builds.apache.org/job/Juneau-Java-1.8/ws/juneau-examples/juneau-examples-rest/src/test/resources>
[INFO] Copying 3 resources
[INFO] 
[INFO] --- maven-compiler-plugin:3.5.1:testCompile (default-testCompile) @ juneau-examples-rest
---
[INFO] Changes detected - recompiling the module!
[INFO] Compiling 10 source files to <https://builds.apache.org/job/Juneau-Java-1.8/ws/juneau-examples/juneau-examples-rest/target/test-classes>
[INFO] 
[INFO] --- maven-surefire-plugin:2.19.1:test (default-test) @ juneau-examples-rest ---

-------------------------------------------------------
 T E S T S
-------------------------------------------------------
Running org.apache.juneau.examples.rest._TestSuite
Running class 'RestMicroservice' using config file 'examples.cfg'.
Server started on port 10000

List of available commands:
	exit -- Shut down service
	restart -- Restarts service
	help -- Commands help
	echo -- Echo command

> log4j:WARN No appenders could be found for logger (org.apache.http.client.protocol.RequestAddCookies).
log4j:WARN Please initialize the log4j system properly.
log4j:WARN See http://logging.apache.org/log4j/1.2/faq.html#noconfig for more info.
Warning: org.apache.xerces.jaxp.SAXParserImpl$JAXPSAXParser: Property 'http://www.oracle.com/xml/jaxp/properties/entityExpansionLimit'
is not recognized.
Compiler warnings:
  WARNING:  'org.apache.xerces.jaxp.SAXParserImpl: Property 'http://javax.xml.XMLConstants/property/accessExternalDTD'
is not recognized.'
WARNING:  RestClient garbage collected before it was finalized.
Creation stack traces can be displayed by setting the system property 'org.apache.juneau.rest.client.RestClient.trackLifecycle'
to true.
Stopping server.
Server stopped.
Tests run: 31, Failures: 0, Errors: 1, Skipped: 0, Time elapsed: 15.199 sec <<< FAILURE!
- in org.apache.juneau.examples.rest._TestSuite
testProxyInterface(org.apache.juneau.examples.rest.AddressBookResourceTest)  Time elapsed:
0.218 sec  <<< ERROR!
java.lang.RuntimeException: org.apache.juneau.rest.client.RestCallException: Connection reset
	at org.apache.juneau.examples.rest.AddressBookResourceTest.testProxyInterface(AddressBookResourceTest.java:287)
Caused by: org.apache.juneau.rest.client.RestCallException: Connection reset
	at org.apache.juneau.examples.rest.AddressBookResourceTest.testProxyInterface(AddressBookResourceTest.java:287)
Caused by: java.net.SocketException: Connection reset
	at org.apache.juneau.examples.rest.AddressBookResourceTest.testProxyInterface(AddressBookResourceTest.java:287)

[JsonSchemaSerializer] = [7,17,70%]
[PlainTextParser] = [3,22,88%]
[UrlEncodingSerializer] = [10,40,80%]
[SoapXmlSerializer] = [6,18,75%]
[JsonSerializer] = [13,24,64%]
[Simple] = [7,17,70%]
[HtmlDocSerializer] = [22,2,8%]
[UrlEncodingParser] = [4,20,83%]
[UonPartParser] = [1,3,75%]
[ImageParser] = [1,1,50%]
[HtmlStrippedDocSerializer] = [8,16,66%]
[MsgPackSerializer] = [7,19,73%]
[JsonParser] = [4,26,86%]
[UonSerializer] = [8,18,69%]
[XmlParser] = [4,23,85%]
[Turtle] = [8,4,33%]
[MsgPackParser] = [3,22,88%]
[N3] = [8,4,33%]
[PlainTextSerializer] = [7,19,73%]
[XmlDocSerializer] = [6,18,75%]
[UonParser] = [4,21,84%]
[ImageSerializer] = [1,0,0%]
[XmlSchemaDocSerializer] = [7,17,70%]
[HtmlSchemaDocSerializer] = [23,1,4%]
[RdfSerializer] = [4,0,0%]
[BeanContext] = [4,23,85%]
[HtmlParser] = [4,23,85%]
[HtmlSerializer] = [2,0,0%]
[Xml] = [8,4,33%]
[NTriple] = [8,4,33%]
[XmlAbbrev] = [5,1,16%]
[XmlSerializer] = [2,2,50%]
[RdfParser] = [4,0,0%]
[total] = [213,429,66%]

Results :

Tests in error: 
  AddressBookResourceTest.testProxyInterface:287 ยป Runtime org.apache.juneau.res...

Tests run: 31, Failures: 0, Errors: 1, Skipped: 0

[INFO] ------------------------------------------------------------------------
[INFO] Reactor Summary:
[INFO] 
[INFO] Apache Juneau ...................................... SUCCESS [ 14.689 s]
[INFO] Apache Juneau - Core APIs .......................... SUCCESS [  4.345 s]
[INFO] Apache Juneau Marshall ............................. SUCCESS [01:03 min]
[INFO] Apache Juneau Marshal RDF .......................... SUCCESS [ 14.200 s]
[INFO] Apache Juneau Data Transfer Objects ................ SUCCESS [ 18.784 s]
[INFO] Apache Juneau Core ................................. SUCCESS [ 12.015 s]
[INFO] Apache Juneau Config File API ...................... SUCCESS [ 12.845 s]
[INFO] Apache Juneau Core Tests ........................... SUCCESS [01:43 min]
[INFO] Apache Juneau - REST APIs .......................... SUCCESS [  3.423 s]
[INFO] Apache Juneau REST Servlet API ..................... SUCCESS [ 16.584 s]
[INFO] Apache Juneau REST JAX/RS API ...................... SUCCESS [ 10.004 s]
[INFO] Apache Juneau REST Client API ...................... SUCCESS [ 12.523 s]
[INFO] Apache Juneau - Microservice APIs .................. SUCCESS [  3.525 s]
[INFO] Apache Juneau Microservice Server .................. SUCCESS [ 16.577 s]
[INFO] Apache Juneau Microservice Template ................ SUCCESS [ 10.397 s]
[INFO] Apache Juneau - Examples ........................... SUCCESS [  3.350 s]
[INFO] Apache Juneau REST Examples ........................ FAILURE [ 17.838 s]
[INFO] Apache Juneau Microservice Tests ................... SKIPPED
[INFO] Apache Juneau Core Examples ........................ SKIPPED
[INFO] Apache Juneau Javadocs ............................. SKIPPED
[INFO] Apache Juneau - Release Engineering ................ SKIPPED
[INFO] Apache Juneau UberJar .............................. SKIPPED
[INFO] Apache Juneau Distribution ......................... SKIPPED
[INFO] ------------------------------------------------------------------------
[INFO] BUILD FAILURE
[INFO] ------------------------------------------------------------------------
[INFO] Total time: 05:42 min
[INFO] Finished at: 2018-01-01T19:37:22+00:00
[INFO] Final Memory: 97M/3853M
[INFO] ------------------------------------------------------------------------
[ERROR] Failed to execute goal org.apache.maven.plugins:maven-surefire-plugin:2.19.1:test
(default-test) on project juneau-examples-rest: There are test failures.
[ERROR] 
[ERROR] Please refer to <https://builds.apache.org/job/Juneau-Java-1.8/ws/juneau-examples/juneau-examples-rest/target/surefire-reports>
for the individual test results.
[ERROR] -> [Help 1]
[ERROR] 
[ERROR] To see the full stack trace of the errors, re-run Maven with the -e switch.
[ERROR] Re-run Maven using the -X switch to enable full debug logging.
[ERROR] 
[ERROR] For more information about the errors and possible solutions, please read the following
articles:
[ERROR] [Help 1] http://cwiki.apache.org/confluence/display/MAVEN/MojoFailureException
[ERROR] 
[ERROR] After correcting the problems, you can resume the build with the command
[ERROR]   mvn <goals> -rf :juneau-examples-rest
Build step 'Invoke top-level Maven targets' marked build as failure

Mime
View raw message