juneau-dev mailing list archives

Site index · List index
Message view « Date » · « Thread »
Top « Date » · « Thread »
From Apache Jenkins Server <jenk...@builds.apache.org>
Subject Build failed in Jenkins: Juneau-Java-1.8 #639
Date Thu, 04 Jan 2018 17:27:57 GMT
See <https://builds.apache.org/job/Juneau-Java-1.8/639/display/redirect?page=changes>

Changes:

[JamesBognar] Improvements to static files support in REST.

[JamesBognar] Remove unused field.

------------------------------------------
[...truncated 149.28 KB...]
Downloading: https://repository.apache.org/content/repositories/snapshots/org/apache/juneau/juneau-config/7.0.2-SNAPSHOT/maven-metadata.xml
998/998 B               Downloaded: https://repository.apache.org/content/repositories/snapshots/org/apache/juneau/juneau-config/7.0.2-SNAPSHOT/maven-metadata.xml
(998 B at 1.6 KB/sec)
Uploading: https://repository.apache.org/content/repositories/snapshots/org/apache/juneau/juneau-config/7.0.2-SNAPSHOT/juneau-config-7.0.2-20180104.172437-50.jar
2/65 KB     4/65 KB   6/65 KB   8/65 KB   10/65 KB   12/65 KB   14/65 KB   16/65 KB   18/65
KB   20/65 KB   22/65 KB   24/65 KB   26/65 KB   28/65 KB   30/65 KB   32/65 KB   34/65 KB
  36/65 KB   38/65 KB   40/65 KB   42/65 KB   44/65 KB   46/65 KB   48/65 KB   50/65 KB  
52/65 KB   54/65 KB   56/65 KB   58/65 KB   60/65 KB   62/65 KB   64/65 KB   65/65 KB    
         Uploaded: https://repository.apache.org/content/repositories/snapshots/org/apache/juneau/juneau-config/7.0.2-SNAPSHOT/juneau-config-7.0.2-20180104.172437-50.jar
(65 KB at 76.6 KB/sec)
Uploading: https://repository.apache.org/content/repositories/snapshots/org/apache/juneau/juneau-config/7.0.2-SNAPSHOT/juneau-config-7.0.2-20180104.172437-50.pom
2/4 KB     4/4 KB            Uploaded: https://repository.apache.org/content/repositories/snapshots/org/apache/juneau/juneau-config/7.0.2-SNAPSHOT/juneau-config-7.0.2-20180104.172437-50.pom
(4 KB at 5.1 KB/sec)
Downloading: https://repository.apache.org/content/repositories/snapshots/org/apache/juneau/juneau-config/maven-metadata.xml
452/452 B               Downloaded: https://repository.apache.org/content/repositories/snapshots/org/apache/juneau/juneau-config/maven-metadata.xml
(452 B at 0.9 KB/sec)
Uploading: https://repository.apache.org/content/repositories/snapshots/org/apache/juneau/juneau-config/7.0.2-SNAPSHOT/maven-metadata.xml
998/998 B               Uploaded: https://repository.apache.org/content/repositories/snapshots/org/apache/juneau/juneau-config/7.0.2-SNAPSHOT/maven-metadata.xml
(998 B at 1.1 KB/sec)
Uploading: https://repository.apache.org/content/repositories/snapshots/org/apache/juneau/juneau-config/maven-metadata.xml
452/452 B               Uploaded: https://repository.apache.org/content/repositories/snapshots/org/apache/juneau/juneau-config/maven-metadata.xml
(452 B at 0.6 KB/sec)
Uploading: https://repository.apache.org/content/repositories/snapshots/org/apache/juneau/juneau-config/7.0.2-SNAPSHOT/juneau-config-7.0.2-20180104.172437-50-sources.jar
2/186 KB    4/186 KB   6/186 KB   8/186 KB   10/186 KB   12/186 KB   14/186 KB   16/186 KB
  18/186 KB   20/186 KB   22/186 KB   24/186 KB   26/186 KB   28/186 KB   30/186 KB   32/186
KB   34/186 KB   36/186 KB   38/186 KB   40/186 KB   42/186 KB   44/186 KB   46/186 KB   48/186
KB   50/186 KB   52/186 KB   54/186 KB   56/186 KB   58/186 KB   60/186 KB   62/186 KB   64/186
KB   66/186 KB   68/186 KB   70/186 KB   72/186 KB   74/186 KB   76/186 KB   78/186 KB   80/186
KB   82/186 KB   84/186 KB   86/186 KB   88/186 KB   90/186 KB   92/186 KB   94/186 KB   96/186
KB   98/186 KB   100/186 KB   102/186 KB   104/186 KB   106/186 KB   108/186 KB   110/186
KB   112/186 KB   114/186 KB   116/186 KB   118/186 KB   120/186 KB   122/186 KB   124/186
KB   126/186 KB   128/186 KB   130/186 KB   132/186 KB   134/186 KB   136/186 KB   138/186
KB   140/186 KB   142/186 KB   144/186 KB   146/186 KB   148/186 KB   150/186 KB   152/186
KB   154/186 KB   156/186 KB   158/186 KB   160/186 KB   162/186 KB   164/186 KB   166/186
KB   168/186 KB   170/186 KB   172/186 KB   174/186 KB   176/186 KB   178/186 KB   180/186
KB   182/186 KB   184/186 KB   186/186 KB                Uploaded: https://repository.apache.org/content/repositories/snapshots/org/apache/juneau/juneau-config/7.0.2-SNAPSHOT/juneau-config-7.0.2-20180104.172437-50-sources.jar
(186 KB at 180.3 KB/sec)
Uploading: https://repository.apache.org/content/repositories/snapshots/org/apache/juneau/juneau-config/7.0.2-SNAPSHOT/maven-metadata.xml
998/998 B                Uploaded: https://repository.apache.org/content/repositories/snapshots/org/apache/juneau/juneau-config/7.0.2-SNAPSHOT/maven-metadata.xml
(998 B at 1.2 KB/sec)
Uploading: https://repository.apache.org/content/repositories/snapshots/org/apache/juneau/juneau-config/7.0.2-SNAPSHOT/juneau-config-7.0.2-20180104.172437-50-sources.jar
2/186 KB    4/186 KB   6/186 KB   8/186 KB   10/186 KB   12/186 KB   14/186 KB   16/186 KB
  18/186 KB   20/186 KB   22/186 KB   24/186 KB   26/186 KB   28/186 KB   30/186 KB   32/186
KB   34/186 KB   36/186 KB   38/186 KB   40/186 KB   42/186 KB   44/186 KB   46/186 KB   48/186
KB   50/186 KB   52/186 KB   54/186 KB   56/186 KB   58/186 KB   60/186 KB   62/186 KB   64/186
KB   66/186 KB   68/186 KB   70/186 KB   72/186 KB   74/186 KB   76/186 KB   78/186 KB   80/186
KB   82/186 KB   84/186 KB   86/186 KB   88/186 KB   90/186 KB   92/186 KB   94/186 KB   96/186
KB   98/186 KB   100/186 KB   102/186 KB   104/186 KB   106/186 KB   108/186 KB   110/186
KB   112/186 KB   114/186 KB   116/186 KB   118/186 KB   120/186 KB   122/186 KB   124/186
KB   126/186 KB   128/186 KB   130/186 KB   132/186 KB   134/186 KB   136/186 KB   138/186
KB   140/186 KB   142/186 KB   144/186 KB   146/186 KB   148/186 KB   150/186 KB   152/186
KB   154/186 KB   156/186 KB   158/186 KB   160/186 KB   162/186 KB   164/186 KB   166/186
KB   168/186 KB   170/186 KB   172/186 KB   174/186 KB   176/186 KB   178/186 KB   180/186
KB   182/186 KB   184/186 KB   186/186 KB                Uploaded: https://repository.apache.org/content/repositories/snapshots/org/apache/juneau/juneau-config/7.0.2-SNAPSHOT/juneau-config-7.0.2-20180104.172437-50-sources.jar
(186 KB at 172.0 KB/sec)
Uploading: https://repository.apache.org/content/repositories/snapshots/org/apache/juneau/juneau-config/7.0.2-SNAPSHOT/maven-metadata.xml
998/998 B                Uploaded: https://repository.apache.org/content/repositories/snapshots/org/apache/juneau/juneau-config/7.0.2-SNAPSHOT/maven-metadata.xml
(998 B at 1.4 KB/sec)
[INFO] 
[INFO] --- maven-bundle-plugin:3.2.0:deploy (default-deploy) @ juneau-config ---
[INFO] Remote OBR update disabled (enable with -DremoteOBR)
[INFO]                                                                         
[INFO] ------------------------------------------------------------------------
[INFO] Building Apache Juneau Core Tests 7.0.2-SNAPSHOT
[INFO] ------------------------------------------------------------------------
[INFO] 
[INFO] --- maven-clean-plugin:3.0.0:clean (default-clean) @ juneau-core-test ---
[INFO] Deleting <https://builds.apache.org/job/Juneau-Java-1.8/ws/juneau-core/juneau-core-test/target>
[INFO] 
[INFO] --- maven-enforcer-plugin:1.4.1:enforce (enforce-maven) @ juneau-core-test ---
[INFO] 
[INFO] --- jacoco-maven-plugin:0.7.2.201409121644:prepare-agent (default-prepare-agent) @
juneau-core-test ---
[INFO] argLine set to -javaagent:/home/jenkins/.m2/repository/org/jacoco/org.jacoco.agent/0.7.2.201409121644/org.jacoco.agent-0.7.2.201409121644-runtime.jar=destfile=<https://builds.apache.org/job/Juneau-Java-1.8/ws/juneau-core/juneau-core-test/target/jacoco.exec>
[INFO] 
[INFO] --- maven-remote-resources-plugin:1.5:process (process-resource-bundles) @ juneau-core-test
---
[INFO] 
[INFO] --- maven-resources-plugin:2.7:resources (default-resources) @ juneau-core-test ---
[INFO] Using 'UTF-8' encoding to copy filtered resources.
[INFO] skip non existing resourceDirectory <https://builds.apache.org/job/Juneau-Java-1.8/ws/juneau-core/juneau-core-test/src/main/resources>
[INFO] Copying 3 resources
[INFO] 
[INFO] --- maven-compiler-plugin:3.5.1:compile (default-compile) @ juneau-core-test ---
[INFO] Nothing to compile - all classes are up to date
[INFO] 
[INFO] --- maven-resources-plugin:2.7:testResources (default-testResources) @ juneau-core-test
---
[INFO] Using 'UTF-8' encoding to copy filtered resources.
[INFO] skip non existing resourceDirectory <https://builds.apache.org/job/Juneau-Java-1.8/ws/juneau-core/juneau-core-test/src/test/resources>
[INFO] Copying 3 resources
[INFO] 
[INFO] --- maven-compiler-plugin:3.5.1:testCompile (default-testCompile) @ juneau-core-test
---
[INFO] Changes detected - recompiling the module!
[INFO] Compiling 174 source files to <https://builds.apache.org/job/Juneau-Java-1.8/ws/juneau-core/juneau-core-test/target/test-classes>
[INFO] 
[INFO] --- maven-surefire-plugin:2.19.1:test (default-test) @ juneau-core-test ---

-------------------------------------------------------
 T E S T S
-------------------------------------------------------
Running org.apache.juneau.html.BasicHtmlTest
Tests run: 504, Failures: 0, Errors: 0, Skipped: 0, Time elapsed: 7.511 sec - in org.apache.juneau.html.BasicHtmlTest
Running org.apache.juneau.html.CommonParserTest
Tests run: 4, Failures: 0, Errors: 0, Skipped: 0, Time elapsed: 0.054 sec - in org.apache.juneau.html.CommonParserTest
Running org.apache.juneau.html.CommonTest
Tests run: 9, Failures: 0, Errors: 0, Skipped: 0, Time elapsed: 1.035 sec - in org.apache.juneau.html.CommonTest
Running org.apache.juneau.html.HtmlTest
Tests run: 5, Failures: 0, Errors: 0, Skipped: 0, Time elapsed: 0.403 sec - in org.apache.juneau.html.HtmlTest
Running org.apache.juneau.dto.html5.Html5BasicTest
Tests run: 1, Failures: 0, Errors: 0, Skipped: 0, Time elapsed: 3 sec - in org.apache.juneau.dto.html5.Html5BasicTest
Running org.apache.juneau.dto.html5.Html5TemplateComboTest
Tests run: 65, Failures: 0, Errors: 0, Skipped: 0, Time elapsed: 9.484 sec - in org.apache.juneau.dto.html5.Html5TemplateComboTest
Running org.apache.juneau.dto.html5.Html5ComboTest
Tests run: 4550, Failures: 0, Errors: 0, Skipped: 0, Time elapsed: 27.575 sec - in org.apache.juneau.dto.html5.Html5ComboTest
Running org.apache.juneau.dto.jsonschema.JsonSchemaTest
Tests run: 3, Failures: 0, Errors: 0, Skipped: 0, Time elapsed: 0.001 sec - in org.apache.juneau.dto.jsonschema.JsonSchemaTest
Running org.apache.juneau.dto.cognos.CognosXmlTest
Tests run: 1, Failures: 0, Errors: 0, Skipped: 0, Time elapsed: 0 sec - in org.apache.juneau.dto.cognos.CognosXmlTest
Running org.apache.juneau.dto.atom.AtomTest
Tests run: 4, Failures: 0, Errors: 0, Skipped: 0, Time elapsed: 0.526 sec - in org.apache.juneau.dto.atom.AtomTest
Running org.apache.juneau.utils.CollectionUtilsTest
Tests run: 1, Failures: 0, Errors: 0, Skipped: 0, Time elapsed: 0.002 sec - in org.apache.juneau.utils.CollectionUtilsTest
Running org.apache.juneau.utils.IOUtilsTest
Tests run: 1, Failures: 0, Errors: 0, Skipped: 0, Time elapsed: 0.014 sec - in org.apache.juneau.utils.IOUtilsTest
Running org.apache.juneau.utils.FilteredMapTest
Tests run: 1, Failures: 0, Errors: 0, Skipped: 0, Time elapsed: 0.004 sec - in org.apache.juneau.utils.FilteredMapTest
Running org.apache.juneau.utils.PojoQueryTest
Tests run: 5, Failures: 0, Errors: 0, Skipped: 0, Time elapsed: 0.611 sec - in org.apache.juneau.utils.PojoQueryTest
Running org.apache.juneau.utils.MultiIterableTest
Tests run: 1, Failures: 0, Errors: 0, Skipped: 0, Time elapsed: 0.005 sec - in org.apache.juneau.utils.MultiIterableTest
Running org.apache.juneau.utils.StringVarResolverTest
Tests run: 7, Failures: 0, Errors: 0, Skipped: 0, Time elapsed: 0.033 sec - in org.apache.juneau.utils.StringVarResolverTest
Running org.apache.juneau.utils.UriContextResolutionComboTest
Tests run: 720, Failures: 0, Errors: 0, Skipped: 0, Time elapsed: 0.449 sec - in org.apache.juneau.utils.UriContextResolutionComboTest
Running org.apache.juneau.utils.ArgsTest
Tests run: 1, Failures: 0, Errors: 0, Skipped: 0, Time elapsed: 0 sec - in org.apache.juneau.utils.ArgsTest
Running org.apache.juneau.utils.StringUtilsTest
Tests run: 24, Failures: 0, Errors: 0, Skipped: 0, Time elapsed: 0.152 sec - in org.apache.juneau.utils.StringUtilsTest
Running org.apache.juneau.utils.SimpleMapTest
Tests run: 1, Failures: 0, Errors: 0, Skipped: 0, Time elapsed: 0.039 sec - in org.apache.juneau.utils.SimpleMapTest
Running org.apache.juneau.utils.ClassUtilsTest
Tests run: 9, Failures: 0, Errors: 0, Skipped: 0, Time elapsed: 0.041 sec - in org.apache.juneau.utils.ClassUtilsTest
Running org.apache.juneau.utils.PojoRestTest
Tests run: 10, Failures: 0, Errors: 0, Skipped: 0, Time elapsed: 0.56 sec - in org.apache.juneau.utils.PojoRestTest
Running org.apache.juneau.utils.ByteArrayInOutStreamTest
Tests run: 1, Failures: 0, Errors: 0, Skipped: 0, Time elapsed: 0.018 sec - in org.apache.juneau.utils.ByteArrayInOutStreamTest
Running org.apache.juneau.utils.ByteArrayCacheTest
Tests run: 1, Failures: 0, Errors: 0, Skipped: 0, Time elapsed: 0.018 sec - in org.apache.juneau.utils.ByteArrayCacheTest
Running org.apache.juneau.utils.StringBuilderWriterTest
Tests run: 1, Failures: 0, Errors: 0, Skipped: 0, Time elapsed: 0.013 sec - in org.apache.juneau.utils.StringBuilderWriterTest
Running org.apache.juneau.utils.CharSetTest
Tests run: 1, Failures: 0, Errors: 0, Skipped: 0, Time elapsed: 0.002 sec - in org.apache.juneau.utils.CharSetTest
Running org.apache.juneau.utils.ArrayUtilsTest
Tests run: 9, Failures: 0, Errors: 0, Skipped: 0, Time elapsed: 0.054 sec - in org.apache.juneau.utils.ArrayUtilsTest
Running org.apache.juneau.utils.MultiSetTest
Tests run: 1, Failures: 0, Errors: 0, Skipped: 0, Time elapsed: 0.029 sec - in org.apache.juneau.utils.MultiSetTest
Running org.apache.juneau.utils.KeywordStoreTest
Tests run: 1, Failures: 0, Errors: 0, Skipped: 0, Time elapsed: 0.008 sec - in org.apache.juneau.utils.KeywordStoreTest
Running org.apache.juneau.utils.IOPipeTest
Tests run: 5, Failures: 0, Errors: 0, Skipped: 0, Time elapsed: 0.105 sec - in org.apache.juneau.utils.IOPipeTest
Running org.apache.juneau.utils.UriContextUriComboTest
Tests run: 70, Failures: 0, Errors: 0, Skipped: 0, Time elapsed: 0.137 sec - in org.apache.juneau.utils.UriContextUriComboTest
Running org.apache.juneau.utils.ParserReaderTest
Tests run: 1, Failures: 0, Errors: 0, Skipped: 0, Time elapsed: 0.004 sec - in org.apache.juneau.utils.ParserReaderTest
Running org.apache.juneau.utils.PojoMergeTest
Tests run: 1, Failures: 0, Errors: 0, Skipped: 0, Time elapsed: 0.034 sec - in org.apache.juneau.utils.PojoMergeTest
Running org.apache.juneau.utils.IdentityListTest
Tests run: 1, Failures: 0, Errors: 0, Skipped: 0, Time elapsed: 0.037 sec - in org.apache.juneau.utils.IdentityListTest
Running org.apache.juneau.utils.PojoIntrospectorTest
Tests run: 1, Failures: 0, Errors: 0, Skipped: 0, Time elapsed: 0.003 sec - in org.apache.juneau.utils.PojoIntrospectorTest
Running org.apache.juneau.serializer.UriResolutionTest
Tests run: 390, Failures: 0, Errors: 0, Skipped: 0, Time elapsed: 4.173 sec - in org.apache.juneau.serializer.UriResolutionTest
Running org.apache.juneau.serializer.SerializerGroupTest
Tests run: 3, Failures: 0, Errors: 0, Skipped: 0, Time elapsed: 0.143 sec - in org.apache.juneau.serializer.SerializerGroupTest
Running org.apache.juneau.serializer.ReaderObjectComboTest
Tests run: 189, Failures: 0, Errors: 0, Skipped: 0, Time elapsed: 0.641 sec - in org.apache.juneau.serializer.ReaderObjectComboTest
Running org.apache.juneau.json.JsonParserEdgeCasesTest
Tests run: 636, Failures: 0, Errors: 0, Skipped: 0, Time elapsed: 0.849 sec - in org.apache.juneau.json.JsonParserEdgeCasesTest
Running org.apache.juneau.json.JsonSchemaTest
Tests run: 1, Failures: 0, Errors: 0, Skipped: 0, Time elapsed: 0.044 sec - in org.apache.juneau.json.JsonSchemaTest
Running org.apache.juneau.json.CommonParserTest
Tests run: 4, Failures: 0, Errors: 0, Skipped: 0, Time elapsed: 0.056 sec - in org.apache.juneau.json.CommonParserTest
Running org.apache.juneau.json.CommonTest
Tests run: 9, Failures: 0, Errors: 0, Skipped: 0, Time elapsed: 0.382 sec - in org.apache.juneau.json.CommonTest
Running org.apache.juneau.json.JsonTest
Tests run: 10, Failures: 0, Errors: 0, Skipped: 0, Time elapsed: 0.034 sec - in org.apache.juneau.json.JsonTest
Running org.apache.juneau.json.JsonParserTest
Tests run: 7, Failures: 0, Errors: 0, Skipped: 0, Time elapsed: 0.062 sec - in org.apache.juneau.json.JsonParserTest
Running org.apache.juneau.csv.CsvTest
Tests run: 1, Failures: 0, Errors: 0, Skipped: 0, Time elapsed: 0.074 sec - in org.apache.juneau.csv.CsvTest
Running org.apache.juneau.ini.ConfigFileBuilderTest
---Usage---
java -cp juneau.jar org.apache.juneau.ini.ConfigFile createBatchEnvFile -configFile <configFile>
-envFile <envFile> [-verbose]
java -cp juneau.jar org.apache.juneau.ini.ConfigFile createShellEnvFile -configFile <configFile>
-envFile <envFile> [-verbose]
java -cp juneau.jar org.apache.juneau.ini.ConfigFile setVals -configFile <configFile>
-vals [var1 val1 [var2 val2...]] [-verbose]
Tests run: 5, Failures: 0, Errors: 0, Skipped: 0, Time elapsed: 0.311 sec - in org.apache.juneau.ini.ConfigFileBuilderTest
Running org.apache.juneau.ini.ConfigFileTest
Tests run: 45, Failures: 0, Errors: 0, Skipped: 0, Time elapsed: 0.646 sec - in org.apache.juneau.ini.ConfigFileTest
Running org.apache.juneau.ini.ConfigFileInterfaceTest
Tests run: 47, Failures: 0, Errors: 0, Skipped: 0, Time elapsed: 0.58 sec - in org.apache.juneau.ini.ConfigFileInterfaceTest
Running org.apache.juneau.IgnoredClassesTest
Tests run: 2, Failures: 0, Errors: 0, Skipped: 1, Time elapsed: 0.099 sec - in org.apache.juneau.IgnoredClassesTest
Running org.apache.juneau.jena.RdfTest
Tests run: 4, Failures: 0, Errors: 0, Skipped: 0, Time elapsed: 0.761 sec - in org.apache.juneau.jena.RdfTest
Running org.apache.juneau.jena.CommonParserTest
log4j:WARN No appenders could be found for logger (com.hp.hpl.jena.rdf.model.impl.RDFDefaultErrorHandler).
log4j:WARN Please initialize the log4j system properly.
log4j:WARN See http://logging.apache.org/log4j/1.2/faq.html#noconfig for more info.
Tests run: 4, Failures: 0, Errors: 0, Skipped: 0, Time elapsed: 0.722 sec - in org.apache.juneau.jena.CommonParserTest
Running org.apache.juneau.jena.CommonTest
Tests run: 8, Failures: 0, Errors: 0, Skipped: 0, Time elapsed: 0.386 sec - in org.apache.juneau.jena.CommonTest
Running org.apache.juneau.jena.CommonXmlTest
Tests run: 2, Failures: 0, Errors: 0, Skipped: 0, Time elapsed: 0.051 sec - in org.apache.juneau.jena.CommonXmlTest
Running org.apache.juneau.jena.RdfParserTest
Tests run: 1, Failures: 0, Errors: 0, Skipped: 0, Time elapsed: 0.152 sec - in org.apache.juneau.jena.RdfParserTest
Running org.apache.juneau.msgpack.MsgPackSerialzierTest
Tests run: 1, Failures: 0, Errors: 0, Skipped: 0, Time elapsed: 0.076 sec - in org.apache.juneau.msgpack.MsgPackSerialzierTest
Running org.apache.juneau.https.AcceptExtensionsTest
Tests run: 2, Failures: 0, Errors: 0, Skipped: 0, Time elapsed: 0.014 sec - in org.apache.juneau.https.AcceptExtensionsTest
Running org.apache.juneau.https.AcceptTest
Tests run: 146, Failures: 0, Errors: 0, Skipped: 0, Time elapsed: 0.387 sec - in org.apache.juneau.https.AcceptTest
Running org.apache.juneau.https.ContentTypeTest
Tests run: 21, Failures: 0, Errors: 0, Skipped: 0, Time elapsed: 0.109 sec - in org.apache.juneau.https.ContentTypeTest
Running org.apache.juneau.https.MediaRangeTest
Tests run: 17, Failures: 0, Errors: 0, Skipped: 0, Time elapsed: 0.039 sec - in org.apache.juneau.https.MediaRangeTest
Running org.apache.juneau.MaxIndentTest
Tests run: 70, Failures: 0, Errors: 0, Skipped: 0, Time elapsed: 0.35 sec - in org.apache.juneau.MaxIndentTest
Running org.apache.juneau.internal.VersionRangeTest
Tests run: 22, Failures: 0, Errors: 0, Skipped: 0, Time elapsed: 0.082 sec - in org.apache.juneau.internal.VersionRangeTest
Running org.apache.juneau.BeanConfigTest
Tests run: 11, Failures: 0, Errors: 0, Skipped: 0, Time elapsed: 1.503 sec - in org.apache.juneau.BeanConfigTest
Running org.apache.juneau.parser.ParserGroupTest
Tests run: 2, Failures: 0, Errors: 0, Skipped: 0, Time elapsed: 0.36 sec - in org.apache.juneau.parser.ParserGroupTest
Running org.apache.juneau.PropertyStore2Test
Tests run: 59, Failures: 0, Errors: 0, Skipped: 0, Time elapsed: 8.543 sec - in org.apache.juneau.PropertyStore2Test
Running org.apache.juneau.transforms.ReaderObjectSwapTest
Tests run: 231, Failures: 0, Errors: 0, Skipped: 0, Time elapsed: 0.958 sec - in org.apache.juneau.transforms.ReaderObjectSwapTest
Running org.apache.juneau.transforms.LocalizedDatesTest

Results :

Tests run: 7971, Failures: 0, Errors: 0, Skipped: 1

[INFO] ------------------------------------------------------------------------
[INFO] Reactor Summary:
[INFO] 
[INFO] Apache Juneau ...................................... SUCCESS [08:03 min]
[INFO] Apache Juneau - Core APIs .......................... SUCCESS [ 11.274 s]
[INFO] Apache Juneau Marshall ............................. SUCCESS [02:25 min]
[INFO] Apache Juneau Marshal RDF .......................... SUCCESS [ 22.636 s]
[INFO] Apache Juneau Data Transfer Objects ................ SUCCESS [01:26 min]
[INFO] Apache Juneau Core ................................. SUCCESS [ 37.117 s]
[INFO] Apache Juneau Config File API ...................... SUCCESS [ 28.991 s]
[INFO] Apache Juneau Core Tests ........................... FAILURE [03:01 min]
[INFO] Apache Juneau - REST APIs .......................... SKIPPED
[INFO] Apache Juneau REST Servlet API ..................... SKIPPED
[INFO] Apache Juneau REST JAX/RS API ...................... SKIPPED
[INFO] Apache Juneau REST Client API ...................... SKIPPED
[INFO] Apache Juneau - Microservice APIs .................. SKIPPED
[INFO] Apache Juneau Microservice Server .................. SKIPPED
[INFO] Apache Juneau Microservice Template ................ SKIPPED
[INFO] Apache Juneau - Examples ........................... SKIPPED
[INFO] Apache Juneau REST Examples ........................ SKIPPED
[INFO] Apache Juneau Microservice Tests ................... SKIPPED
[INFO] Apache Juneau Core Examples ........................ SKIPPED
[INFO] Apache Juneau Javadocs ............................. SKIPPED
[INFO] Apache Juneau - Release Engineering ................ SKIPPED
[INFO] Apache Juneau UberJar .............................. SKIPPED
[INFO] Apache Juneau Distribution ......................... SKIPPED
[INFO] ------------------------------------------------------------------------
[INFO] BUILD FAILURE
[INFO] ------------------------------------------------------------------------
[INFO] Total time: 16:54 min
[INFO] Finished at: 2018-01-04T17:27:46+00:00
[INFO] Final Memory: 66M/2031M
[INFO] ------------------------------------------------------------------------
[ERROR] Failed to execute goal org.apache.maven.plugins:maven-surefire-plugin:2.19.1:test
(default-test) on project juneau-core-test: Execution default-test of goal org.apache.maven.plugins:maven-surefire-plugin:2.19.1:test
failed: The forked VM terminated without properly saying goodbye. VM crash or System.exit
called?
[ERROR] Command was /bin/sh -c cd <https://builds.apache.org/job/Juneau-Java-1.8/ws/juneau-core/juneau-core-test>
&& /usr/local/asfpackages/java/jdk1.8.0_152/jre/bin/java -javaagent:/home/jenkins/.m2/repository/org/jacoco/org.jacoco.agent/0.7.2.201409121644/org.jacoco.agent-0.7.2.201409121644-runtime.jar=destfile=<https://builds.apache.org/job/Juneau-Java-1.8/ws/juneau-core/juneau-core-test/target/jacoco.exec>
-jar <https://builds.apache.org/job/Juneau-Java-1.8/ws/juneau-core/juneau-core-test/target/surefire/surefirebooter2472148162186859257.jar>
<https://builds.apache.org/job/Juneau-Java-1.8/ws/juneau-core/juneau-core-test/target/surefire/surefire6003414867311322157tmp>
<https://builds.apache.org/job/Juneau-Java-1.8/ws/juneau-core/juneau-core-test/target/surefire/surefire_07914556568984885306tmp>
[ERROR] -> [Help 1]
[ERROR] 
[ERROR] To see the full stack trace of the errors, re-run Maven with the -e switch.
[ERROR] Re-run Maven using the -X switch to enable full debug logging.
[ERROR] 
[ERROR] For more information about the errors and possible solutions, please read the following
articles:
[ERROR] [Help 1] http://cwiki.apache.org/confluence/display/MAVEN/PluginExecutionException
[ERROR] 
[ERROR] After correcting the problems, you can resume the build with the command
[ERROR]   mvn <goals> -rf :juneau-core-test
Build step 'Invoke top-level Maven targets' marked build as failure

Mime
View raw message