juneau-dev mailing list archives

Site index · List index
Message view « Date » · « Thread »
Top « Date » · « Thread »
From Apache Jenkins Server <jenk...@builds.apache.org>
Subject Build failed in Jenkins: Juneau-Java-1.8 #671
Date Tue, 09 Jan 2018 04:01:51 GMT
See <https://builds.apache.org/job/Juneau-Java-1.8/671/display/redirect>

------------------------------------------
[...truncated 133.36 KB...]
Uploading: https://repository.apache.org/content/repositories/snapshots/org/apache/juneau/juneau-svl/7.0.2-SNAPSHOT/maven-metadata.xml
995/995 B               Uploaded: https://repository.apache.org/content/repositories/snapshots/org/apache/juneau/juneau-svl/7.0.2-SNAPSHOT/maven-metadata.xml
(995 B at 1.3 KB/sec)
[INFO] 
[INFO] --- maven-bundle-plugin:3.2.0:deploy (default-deploy) @ juneau-svl ---
[INFO] Remote OBR update disabled (enable with -DremoteOBR)
[INFO]                                                                         
[INFO] ------------------------------------------------------------------------
[INFO] Building Apache Juneau Config File API 7.0.2-SNAPSHOT
[INFO] ------------------------------------------------------------------------
[INFO] 
[INFO] --- maven-clean-plugin:3.0.0:clean (default-clean) @ juneau-config ---
[INFO] Deleting <https://builds.apache.org/job/Juneau-Java-1.8/ws/juneau-core/juneau-config/target>
[INFO] 
[INFO] --- maven-enforcer-plugin:1.4.1:enforce (enforce-maven) @ juneau-config ---
[INFO] 
[INFO] --- jacoco-maven-plugin:0.7.2.201409121644:prepare-agent (default-prepare-agent) @
juneau-config ---
[INFO] argLine set to -javaagent:/home/jenkins/.m2/repository/org/jacoco/org.jacoco.agent/0.7.2.201409121644/org.jacoco.agent-0.7.2.201409121644-runtime.jar=destfile=<https://builds.apache.org/job/Juneau-Java-1.8/ws/juneau-core/juneau-config/target/jacoco.exec>
[INFO] 
[INFO] --- maven-remote-resources-plugin:1.5:process (process-resource-bundles) @ juneau-config
---
[INFO] 
[INFO] --- maven-resources-plugin:2.7:resources (default-resources) @ juneau-config ---
[INFO] Using 'UTF-8' encoding to copy filtered resources.
[INFO] skip non existing resourceDirectory <https://builds.apache.org/job/Juneau-Java-1.8/ws/juneau-core/juneau-config/src/main/resources>
[INFO] Copying 3 resources
[INFO] 
[INFO] --- maven-compiler-plugin:3.5.1:compile (default-compile) @ juneau-config ---
[INFO] Changes detected - recompiling the module!
[INFO] Compiling 19 source files to <https://builds.apache.org/job/Juneau-Java-1.8/ws/juneau-core/juneau-config/target/classes>
[INFO] 
[INFO] --- maven-resources-plugin:2.7:testResources (default-testResources) @ juneau-config
---
[INFO] Using 'UTF-8' encoding to copy filtered resources.
[INFO] skip non existing resourceDirectory <https://builds.apache.org/job/Juneau-Java-1.8/ws/juneau-core/juneau-config/src/test/resources>
[INFO] Copying 3 resources
[INFO] 
[INFO] --- maven-compiler-plugin:3.5.1:testCompile (default-testCompile) @ juneau-config ---
[INFO] No sources to compile
[INFO] 
[INFO] --- maven-surefire-plugin:2.19.1:test (default-test) @ juneau-config ---
[INFO] 
[INFO] --- jacoco-maven-plugin:0.7.2.201409121644:report (default-report) @ juneau-config
---
[INFO] Skipping JaCoCo execution due to missing execution data <https://builds.apache.org/job/Juneau-Java-1.8/ws/juneau-core/juneau-config/target/jacoco.exec>
[INFO] 
[INFO] --- maven-bundle-plugin:3.2.0:bundle (default-bundle) @ juneau-config ---
[INFO] 
[INFO] --- maven-site-plugin:3.5.1:attach-descriptor (attach-descriptor) @ juneau-config ---
[INFO] 
[INFO] --- apache-rat-plugin:0.11:check (default) @ juneau-config ---
[INFO] 51 implicit excludes (use -debug for more details).
[INFO] Exclude: **/DEPENDENCIES
[INFO] Exclude: **/target/**
[INFO] Exclude: **/.settings/**
[INFO] Exclude: **/.project
[INFO] Exclude: **/.classpath
[INFO] Exclude: **/*.launch
[INFO] Exclude: **/jetty.out.xml
[INFO] Exclude: **/dependency-reduced-pom.xml
[INFO] 24 resources included (use -debug for more details)
[INFO] Rat check: Summary of files. Unapproved: 0 unknown: 0 generated: 0 approved: 21 licence.
[INFO] 
[INFO] --- maven-source-plugin:3.0.0:jar-no-fork (attach-sources) @ juneau-config ---
[INFO] Building jar: <https://builds.apache.org/job/Juneau-Java-1.8/ws/juneau-core/juneau-config/target/juneau-config-7.0.2-SNAPSHOT-sources.jar>
[INFO] 
[INFO] --- maven-install-plugin:2.5.2:install (default-install) @ juneau-config ---
[INFO] Installing <https://builds.apache.org/job/Juneau-Java-1.8/ws/juneau-core/juneau-config/target/juneau-config-7.0.2-SNAPSHOT.jar>
to /home/jenkins/.m2/repository/org/apache/juneau/juneau-config/7.0.2-SNAPSHOT/juneau-config-7.0.2-SNAPSHOT.jar
[INFO] Installing <https://builds.apache.org/job/Juneau-Java-1.8/ws/juneau-core/juneau-config/pom.xml>
to /home/jenkins/.m2/repository/org/apache/juneau/juneau-config/7.0.2-SNAPSHOT/juneau-config-7.0.2-SNAPSHOT.pom
[INFO] Installing <https://builds.apache.org/job/Juneau-Java-1.8/ws/juneau-core/juneau-config/target/juneau-config-7.0.2-SNAPSHOT-sources.jar>
to /home/jenkins/.m2/repository/org/apache/juneau/juneau-config/7.0.2-SNAPSHOT/juneau-config-7.0.2-SNAPSHOT-sources.jar
[INFO] 
[INFO] --- maven-bundle-plugin:3.2.0:install (default-install) @ juneau-config ---
[INFO] Installing org/apache/juneau/juneau-config/7.0.2-SNAPSHOT/juneau-config-7.0.2-SNAPSHOT.jar
[INFO] Writing OBR metadata
[INFO] 
[INFO] --- maven-enforcer-plugin:1.4.1:enforce (enforce-maven) @ juneau-config ---
[INFO] 
[INFO] --- jacoco-maven-plugin:0.7.2.201409121644:prepare-agent (default-prepare-agent) @
juneau-config ---
[INFO] argLine set to -javaagent:/home/jenkins/.m2/repository/org/jacoco/org.jacoco.agent/0.7.2.201409121644/org.jacoco.agent-0.7.2.201409121644-runtime.jar=destfile=<https://builds.apache.org/job/Juneau-Java-1.8/ws/juneau-core/juneau-config/target/jacoco.exec>
[INFO] 
[INFO] --- maven-remote-resources-plugin:1.5:process (process-resource-bundles) @ juneau-config
---
[INFO] 
[INFO] --- maven-resources-plugin:2.7:resources (default-resources) @ juneau-config ---
[INFO] Using 'UTF-8' encoding to copy filtered resources.
[INFO] skip non existing resourceDirectory <https://builds.apache.org/job/Juneau-Java-1.8/ws/juneau-core/juneau-config/src/main/resources>
[INFO] Copying 3 resources
[INFO] Copying 3 resources
[INFO] 
[INFO] --- maven-compiler-plugin:3.5.1:compile (default-compile) @ juneau-config ---
[INFO] Nothing to compile - all classes are up to date
[INFO] 
[INFO] --- maven-resources-plugin:2.7:testResources (default-testResources) @ juneau-config
---
[INFO] Using 'UTF-8' encoding to copy filtered resources.
[INFO] skip non existing resourceDirectory <https://builds.apache.org/job/Juneau-Java-1.8/ws/juneau-core/juneau-config/src/test/resources>
[INFO] Copying 3 resources
[INFO] Copying 3 resources
[INFO] 
[INFO] --- maven-compiler-plugin:3.5.1:testCompile (default-testCompile) @ juneau-config ---
[INFO] No sources to compile
[INFO] 
[INFO] --- maven-surefire-plugin:2.19.1:test (default-test) @ juneau-config ---
[INFO] Skipping execution of surefire because it has already been run for this configuration
[INFO] 
[INFO] --- jacoco-maven-plugin:0.7.2.201409121644:report (default-report) @ juneau-config
---
[INFO] Skipping JaCoCo execution due to missing execution data <https://builds.apache.org/job/Juneau-Java-1.8/ws/juneau-core/juneau-config/target/jacoco.exec>
[INFO] 
[INFO] --- maven-bundle-plugin:3.2.0:bundle (default-bundle) @ juneau-config ---
[INFO] 
[INFO] --- maven-site-plugin:3.5.1:attach-descriptor (attach-descriptor) @ juneau-config ---
[INFO] 
[INFO] --- apache-rat-plugin:0.11:check (default) @ juneau-config ---
[INFO] 51 implicit excludes (use -debug for more details).
[INFO] Exclude: **/DEPENDENCIES
[INFO] Exclude: **/target/**
[INFO] Exclude: **/.settings/**
[INFO] Exclude: **/.project
[INFO] Exclude: **/.classpath
[INFO] Exclude: **/*.launch
[INFO] Exclude: **/jetty.out.xml
[INFO] Exclude: **/dependency-reduced-pom.xml
[INFO] 24 resources included (use -debug for more details)
[INFO] Rat check: Summary of files. Unapproved: 0 unknown: 0 generated: 0 approved: 21 licence.
[INFO] 
[INFO] --- maven-source-plugin:3.0.0:jar-no-fork (attach-sources) @ juneau-config ---
[INFO] Building jar: <https://builds.apache.org/job/Juneau-Java-1.8/ws/juneau-core/juneau-config/target/juneau-config-7.0.2-SNAPSHOT-sources.jar>
[INFO] 
[INFO] --- maven-install-plugin:2.5.2:install (default-install) @ juneau-config ---
[INFO] Installing <https://builds.apache.org/job/Juneau-Java-1.8/ws/juneau-core/juneau-config/target/juneau-config-7.0.2-SNAPSHOT.jar>
to /home/jenkins/.m2/repository/org/apache/juneau/juneau-config/7.0.2-SNAPSHOT/juneau-config-7.0.2-SNAPSHOT.jar
[INFO] Installing <https://builds.apache.org/job/Juneau-Java-1.8/ws/juneau-core/juneau-config/pom.xml>
to /home/jenkins/.m2/repository/org/apache/juneau/juneau-config/7.0.2-SNAPSHOT/juneau-config-7.0.2-SNAPSHOT.pom
[INFO] Installing <https://builds.apache.org/job/Juneau-Java-1.8/ws/juneau-core/juneau-config/target/juneau-config-7.0.2-SNAPSHOT-sources.jar>
to /home/jenkins/.m2/repository/org/apache/juneau/juneau-config/7.0.2-SNAPSHOT/juneau-config-7.0.2-SNAPSHOT-sources.jar
[INFO] Installing <https://builds.apache.org/job/Juneau-Java-1.8/ws/juneau-core/juneau-config/target/juneau-config-7.0.2-SNAPSHOT-sources.jar>
to /home/jenkins/.m2/repository/org/apache/juneau/juneau-config/7.0.2-SNAPSHOT/juneau-config-7.0.2-SNAPSHOT-sources.jar
[INFO] 
[INFO] --- maven-bundle-plugin:3.2.0:install (default-install) @ juneau-config ---
[INFO] Installing org/apache/juneau/juneau-config/7.0.2-SNAPSHOT/juneau-config-7.0.2-SNAPSHOT.jar
[INFO] Writing OBR metadata
[INFO] 
[INFO] --- maven-deploy-plugin:2.8.2:deploy (default-deploy) @ juneau-config ---
Downloading: https://repository.apache.org/content/repositories/snapshots/org/apache/juneau/juneau-config/7.0.2-SNAPSHOT/maven-metadata.xml
998/998 B               Downloaded: https://repository.apache.org/content/repositories/snapshots/org/apache/juneau/juneau-config/7.0.2-SNAPSHOT/maven-metadata.xml
(998 B at 2.1 KB/sec)
Uploading: https://repository.apache.org/content/repositories/snapshots/org/apache/juneau/juneau-config/7.0.2-SNAPSHOT/juneau-config-7.0.2-20180109.035952-82.jar
2/65 KB     4/65 KB   6/65 KB   8/65 KB   10/65 KB   12/65 KB   14/65 KB   16/65 KB   18/65
KB   20/65 KB   22/65 KB   24/65 KB   26/65 KB   28/65 KB   30/65 KB   32/65 KB   34/65 KB
  36/65 KB   38/65 KB   40/65 KB   42/65 KB   44/65 KB   46/65 KB   48/65 KB   50/65 KB  
52/65 KB   54/65 KB   56/65 KB   58/65 KB   60/65 KB   62/65 KB   64/65 KB   65/65 KB    
         Uploaded: https://repository.apache.org/content/repositories/snapshots/org/apache/juneau/juneau-config/7.0.2-SNAPSHOT/juneau-config-7.0.2-20180109.035952-82.jar
(65 KB at 75.8 KB/sec)
Uploading: https://repository.apache.org/content/repositories/snapshots/org/apache/juneau/juneau-config/7.0.2-SNAPSHOT/juneau-config-7.0.2-20180109.035952-82.pom
2/4 KB     4/4 KB            Uploaded: https://repository.apache.org/content/repositories/snapshots/org/apache/juneau/juneau-config/7.0.2-SNAPSHOT/juneau-config-7.0.2-20180109.035952-82.pom
(4 KB at 5.5 KB/sec)
Downloading: https://repository.apache.org/content/repositories/snapshots/org/apache/juneau/juneau-config/maven-metadata.xml
452/452 B               Downloaded: https://repository.apache.org/content/repositories/snapshots/org/apache/juneau/juneau-config/maven-metadata.xml
(452 B at 0.9 KB/sec)
Uploading: https://repository.apache.org/content/repositories/snapshots/org/apache/juneau/juneau-config/7.0.2-SNAPSHOT/maven-metadata.xml
998/998 B               Uploaded: https://repository.apache.org/content/repositories/snapshots/org/apache/juneau/juneau-config/7.0.2-SNAPSHOT/maven-metadata.xml
(998 B at 1.4 KB/sec)
Uploading: https://repository.apache.org/content/repositories/snapshots/org/apache/juneau/juneau-config/maven-metadata.xml
452/452 B               Uploaded: https://repository.apache.org/content/repositories/snapshots/org/apache/juneau/juneau-config/maven-metadata.xml
(452 B at 0.6 KB/sec)
Uploading: https://repository.apache.org/content/repositories/snapshots/org/apache/juneau/juneau-config/7.0.2-SNAPSHOT/juneau-config-7.0.2-20180109.035952-82-sources.jar
2/186 KB    4/186 KB   6/186 KB   8/186 KB   10/186 KB   12/186 KB   14/186 KB   16/186 KB
  18/186 KB   20/186 KB   22/186 KB   24/186 KB   26/186 KB   28/186 KB   30/186 KB   32/186
KB   34/186 KB   36/186 KB   38/186 KB   40/186 KB   42/186 KB   44/186 KB   46/186 KB   48/186
KB   50/186 KB   52/186 KB   54/186 KB   56/186 KB   58/186 KB   60/186 KB   62/186 KB   64/186
KB   66/186 KB   68/186 KB   70/186 KB   72/186 KB   74/186 KB   76/186 KB   78/186 KB   80/186
KB   82/186 KB   84/186 KB   86/186 KB   88/186 KB   90/186 KB   92/186 KB   94/186 KB   96/186
KB   98/186 KB   100/186 KB   102/186 KB   104/186 KB   106/186 KB   108/186 KB   110/186
KB   112/186 KB   114/186 KB   116/186 KB   118/186 KB   120/186 KB   122/186 KB   124/186
KB   126/186 KB   128/186 KB   130/186 KB   132/186 KB   134/186 KB   136/186 KB   138/186
KB   140/186 KB   142/186 KB   144/186 KB   146/186 KB   148/186 KB   150/186 KB   152/186
KB   154/186 KB   156/186 KB   158/186 KB   160/186 KB   162/186 KB   164/186 KB   166/186
KB   168/186 KB   170/186 KB   172/186 KB   174/186 KB   176/186 KB   178/186 KB   180/186
KB   182/186 KB   184/186 KB   186/186 KB                Uploaded: https://repository.apache.org/content/repositories/snapshots/org/apache/juneau/juneau-config/7.0.2-SNAPSHOT/juneau-config-7.0.2-20180109.035952-82-sources.jar
(186 KB at 205.1 KB/sec)
Uploading: https://repository.apache.org/content/repositories/snapshots/org/apache/juneau/juneau-config/7.0.2-SNAPSHOT/maven-metadata.xml
998/998 B                Uploaded: https://repository.apache.org/content/repositories/snapshots/org/apache/juneau/juneau-config/7.0.2-SNAPSHOT/maven-metadata.xml
(998 B at 1.4 KB/sec)
Uploading: https://repository.apache.org/content/repositories/snapshots/org/apache/juneau/juneau-config/7.0.2-SNAPSHOT/juneau-config-7.0.2-20180109.035952-82-sources.jar
2/186 KB    4/186 KB   6/186 KB   8/186 KB   10/186 KB   12/186 KB   14/186 KB   16/186 KB
  18/186 KB   20/186 KB   22/186 KB   24/186 KB   26/186 KB   28/186 KB   30/186 KB   32/186
KB   34/186 KB   36/186 KB   38/186 KB   40/186 KB   42/186 KB   44/186 KB   46/186 KB   48/186
KB   50/186 KB   52/186 KB   54/186 KB   56/186 KB   58/186 KB   60/186 KB   62/186 KB   64/186
KB   66/186 KB   68/186 KB   70/186 KB   72/186 KB   74/186 KB   76/186 KB   78/186 KB   80/186
KB   82/186 KB   84/186 KB   86/186 KB   88/186 KB   90/186 KB   92/186 KB   94/186 KB   96/186
KB   98/186 KB   100/186 KB   102/186 KB   104/186 KB   106/186 KB   108/186 KB   110/186
KB   112/186 KB   114/186 KB   116/186 KB   118/186 KB   120/186 KB   122/186 KB   124/186
KB   126/186 KB   128/186 KB   130/186 KB   132/186 KB   134/186 KB   136/186 KB   138/186
KB   140/186 KB   142/186 KB   144/186 KB   146/186 KB   148/186 KB   150/186 KB   152/186
KB   154/186 KB   156/186 KB   158/186 KB   160/186 KB   162/186 KB   164/186 KB   166/186
KB   168/186 KB   170/186 KB   172/186 KB   174/186 KB   176/186 KB   178/186 KB   180/186
KB   182/186 KB   184/186 KB   186/186 KB                Uploaded: https://repository.apache.org/content/repositories/snapshots/org/apache/juneau/juneau-config/7.0.2-SNAPSHOT/juneau-config-7.0.2-20180109.035952-82-sources.jar
(186 KB at 189.4 KB/sec)
Uploading: https://repository.apache.org/content/repositories/snapshots/org/apache/juneau/juneau-config/7.0.2-SNAPSHOT/maven-metadata.xml
998/998 B                Uploaded: https://repository.apache.org/content/repositories/snapshots/org/apache/juneau/juneau-config/7.0.2-SNAPSHOT/maven-metadata.xml
(998 B at 1.4 KB/sec)
[INFO] 
[INFO] --- maven-bundle-plugin:3.2.0:deploy (default-deploy) @ juneau-config ---
[INFO] Remote OBR update disabled (enable with -DremoteOBR)
[INFO]                                                                         
[INFO] ------------------------------------------------------------------------
[INFO] Building Apache Juneau Core Tests 7.0.2-SNAPSHOT
[INFO] ------------------------------------------------------------------------
[INFO] 
[INFO] --- maven-clean-plugin:3.0.0:clean (default-clean) @ juneau-core-test ---
[INFO] Deleting <https://builds.apache.org/job/Juneau-Java-1.8/ws/juneau-core/juneau-core-test/target>
[INFO] 
[INFO] --- maven-enforcer-plugin:1.4.1:enforce (enforce-maven) @ juneau-core-test ---
[INFO] 
[INFO] --- jacoco-maven-plugin:0.7.2.201409121644:prepare-agent (default-prepare-agent) @
juneau-core-test ---
[INFO] argLine set to -javaagent:/home/jenkins/.m2/repository/org/jacoco/org.jacoco.agent/0.7.2.201409121644/org.jacoco.agent-0.7.2.201409121644-runtime.jar=destfile=<https://builds.apache.org/job/Juneau-Java-1.8/ws/juneau-core/juneau-core-test/target/jacoco.exec>
[INFO] 
[INFO] --- maven-remote-resources-plugin:1.5:process (process-resource-bundles) @ juneau-core-test
---
[INFO] 
[INFO] --- maven-resources-plugin:2.7:resources (default-resources) @ juneau-core-test ---
[INFO] Using 'UTF-8' encoding to copy filtered resources.
[INFO] skip non existing resourceDirectory <https://builds.apache.org/job/Juneau-Java-1.8/ws/juneau-core/juneau-core-test/src/main/resources>
[INFO] Copying 3 resources
[INFO] 
[INFO] --- maven-compiler-plugin:3.5.1:compile (default-compile) @ juneau-core-test ---
[INFO] Nothing to compile - all classes are up to date
[INFO] 
[INFO] --- maven-resources-plugin:2.7:testResources (default-testResources) @ juneau-core-test
---
[INFO] Using 'UTF-8' encoding to copy filtered resources.
[INFO] skip non existing resourceDirectory <https://builds.apache.org/job/Juneau-Java-1.8/ws/juneau-core/juneau-core-test/src/test/resources>
[INFO] Copying 3 resources
[INFO] 
[INFO] --- maven-compiler-plugin:3.5.1:testCompile (default-testCompile) @ juneau-core-test
---
[INFO] Changes detected - recompiling the module!
[INFO] Compiling 174 source files to <https://builds.apache.org/job/Juneau-Java-1.8/ws/juneau-core/juneau-core-test/target/test-classes>
[INFO] 
[INFO] --- maven-surefire-plugin:2.19.1:test (default-test) @ juneau-core-test ---

-------------------------------------------------------
 T E S T S
-------------------------------------------------------
Running org.apache.juneau.html.BasicHtmlTest
Tests run: 504, Failures: 0, Errors: 0, Skipped: 0, Time elapsed: 3.89 sec - in org.apache.juneau.html.BasicHtmlTest
Running org.apache.juneau.html.CommonParserTest
Tests run: 4, Failures: 0, Errors: 0, Skipped: 0, Time elapsed: 0.067 sec - in org.apache.juneau.html.CommonParserTest
Running org.apache.juneau.html.CommonTest

Results :

Tests run: 508, Failures: 0, Errors: 0, Skipped: 0

[INFO] ------------------------------------------------------------------------
[INFO] Reactor Summary:
[INFO] 
[INFO] Apache Juneau ...................................... SUCCESS [ 23.497 s]
[INFO] Apache Juneau - Core APIs .......................... SUCCESS [  3.896 s]
[INFO] Apache Juneau Marshall ............................. SUCCESS [ 45.106 s]
[INFO] Apache Juneau Marshal RDF .......................... SUCCESS [01:05 min]
[INFO] Apache Juneau Data Transfer Objects ................ SUCCESS [ 19.963 s]
[INFO] Apache Juneau Core ................................. SUCCESS [ 12.699 s]
[INFO] Apache Juneau Config File API ...................... SUCCESS [ 11.664 s]
[INFO] Apache Juneau Core Tests ........................... FAILURE [01:49 min]
[INFO] Apache Juneau - REST APIs .......................... SKIPPED
[INFO] Apache Juneau REST Servlet API ..................... SKIPPED
[INFO] Apache Juneau REST JAX/RS API ...................... SKIPPED
[INFO] Apache Juneau REST Client API ...................... SKIPPED
[INFO] Apache Juneau - Microservice APIs .................. SKIPPED
[INFO] Apache Juneau Microservice Server .................. SKIPPED
[INFO] Apache Juneau Microservice Template ................ SKIPPED
[INFO] Apache Juneau - Examples ........................... SKIPPED
[INFO] Apache Juneau REST Examples ........................ SKIPPED
[INFO] Apache Juneau Microservice Tests ................... SKIPPED
[INFO] Apache Juneau Core Examples ........................ SKIPPED
[INFO] Apache Juneau Javadocs ............................. SKIPPED
[INFO] Apache Juneau - Release Engineering ................ SKIPPED
[INFO] Apache Juneau UberJar .............................. SKIPPED
[INFO] Apache Juneau Distribution ......................... SKIPPED
[INFO] ------------------------------------------------------------------------
[INFO] BUILD FAILURE
[INFO] ------------------------------------------------------------------------
[INFO] Total time: 05:09 min
[INFO] Finished at: 2018-01-09T04:01:47+00:00
[INFO] Final Memory: 80M/2911M
[INFO] ------------------------------------------------------------------------
[ERROR] Failed to execute goal org.apache.maven.plugins:maven-surefire-plugin:2.19.1:test
(default-test) on project juneau-core-test: Execution default-test of goal org.apache.maven.plugins:maven-surefire-plugin:2.19.1:test
failed: The forked VM terminated without properly saying goodbye. VM crash or System.exit
called?
[ERROR] Command was /bin/sh -c cd <https://builds.apache.org/job/Juneau-Java-1.8/ws/juneau-core/juneau-core-test>
&& /usr/local/asfpackages/java/jdk1.8.0_152/jre/bin/java -javaagent:/home/jenkins/.m2/repository/org/jacoco/org.jacoco.agent/0.7.2.201409121644/org.jacoco.agent-0.7.2.201409121644-runtime.jar=destfile=<https://builds.apache.org/job/Juneau-Java-1.8/ws/juneau-core/juneau-core-test/target/jacoco.exec>
-jar <https://builds.apache.org/job/Juneau-Java-1.8/ws/juneau-core/juneau-core-test/target/surefire/surefirebooter1071708454540361548.jar>
<https://builds.apache.org/job/Juneau-Java-1.8/ws/juneau-core/juneau-core-test/target/surefire/surefire7389362965867172474tmp>
<https://builds.apache.org/job/Juneau-Java-1.8/ws/juneau-core/juneau-core-test/target/surefire/surefire_05337406176004802202tmp>
[ERROR] -> [Help 1]
[ERROR] 
[ERROR] To see the full stack trace of the errors, re-run Maven with the -e switch.
[ERROR] Re-run Maven using the -X switch to enable full debug logging.
[ERROR] 
[ERROR] For more information about the errors and possible solutions, please read the following
articles:
[ERROR] [Help 1] http://cwiki.apache.org/confluence/display/MAVEN/PluginExecutionException
[ERROR] 
[ERROR] After correcting the problems, you can resume the build with the command
[ERROR]   mvn <goals> -rf :juneau-core-test
Build step 'Invoke top-level Maven targets' marked build as failure

Mime
View raw message