juneau-dev mailing list archives

Site index · List index
Message view « Date » · « Thread »
Top « Date » · « Thread »
From Apache Jenkins Server <jenk...@builds.apache.org>
Subject Build failed in Jenkins: Juneau-Java-1.8 #583
Date Sun, 03 Dec 2017 17:16:16 GMT
See <https://builds.apache.org/job/Juneau-Java-1.8/583/display/redirect?page=changes>

Changes:

[jamesbognar] Improved microservice console support.

[jamesbognar] Minor API changes.

------------------------------------------
[...truncated 23 B...]
Building remotely on ubuntu-6 (ubuntu trusty) in workspace <https://builds.apache.org/job/Juneau-Java-1.8/ws/>
 > git rev-parse --is-inside-work-tree # timeout=10
Fetching changes from the remote Git repository
 > git config remote.origin.url https://git-wip-us.apache.org/repos/asf/juneau.git # timeout=10
Fetching upstream changes from https://git-wip-us.apache.org/repos/asf/juneau.git
 > git --version # timeout=10
 > git fetch --tags --progress https://git-wip-us.apache.org/repos/asf/juneau.git +refs/heads/*:refs/remotes/origin/*
 > git rev-parse refs/remotes/origin/master^{commit} # timeout=10
 > git rev-parse refs/remotes/origin/origin/master^{commit} # timeout=10
Checking out Revision 9b8b457fd1e504330836a56043670b5f90e48e40 (refs/remotes/origin/master)
 > git config core.sparsecheckout # timeout=10
 > git checkout -f 9b8b457fd1e504330836a56043670b5f90e48e40
Commit message: "Minor API changes."
 > git rev-list 14becdd04921f147c6ea1ace48603bcb86f77676 # timeout=10
[Juneau-Java-1.8] $ /home/jenkins/tools/maven/apache-maven-3.2.5/bin/mvn clean install deploy
[INFO] Scanning for projects...
[INFO] ------------------------------------------------------------------------
[INFO] Reactor Build Order:
[INFO] 
[INFO] Apache Juneau
[INFO] Apache Juneau - Core APIs
[INFO] Apache Juneau Marshall
[INFO] Apache Juneau Marshal RDF
[INFO] Apache Juneau Data Transfer Objects
[INFO] Apache Juneau Core
[INFO] Apache Juneau Config File API
[INFO] Apache Juneau Core Tests
[INFO] Apache Juneau - REST APIs
[INFO] Apache Juneau REST Servlet API
[INFO] Apache Juneau REST JAX/RS API
[INFO] Apache Juneau REST Client API
[INFO] Apache Juneau - Microservice APIs
[INFO] Apache Juneau Microservice Server
[INFO] Apache Juneau Microservice Template
[INFO] Apache Juneau - Examples
[INFO] Apache Juneau REST Examples
[INFO] Apache Juneau Microservice Tests
[INFO] Apache Juneau Core Examples
[INFO] Apache Juneau Javadocs
[INFO] Apache Juneau - Release Engineering
[INFO] Apache Juneau UberJar
[INFO] Apache Juneau Distribution
[INFO]                                                                         
[INFO] ------------------------------------------------------------------------
[INFO] Building Apache Juneau 7.0.1-SNAPSHOT
[INFO] ------------------------------------------------------------------------
[INFO] 
[INFO] --- maven-clean-plugin:3.0.0:clean (default-clean) @ juneau ---
[INFO] Deleting <https://builds.apache.org/job/Juneau-Java-1.8/ws/target>
[INFO] 
[INFO] --- maven-enforcer-plugin:1.4.1:enforce (enforce-maven) @ juneau ---
[INFO] 
[INFO] --- maven-remote-resources-plugin:1.5:process (process-resource-bundles) @ juneau ---
[INFO] 
[INFO] --- maven-site-plugin:3.5.1:attach-descriptor (attach-descriptor) @ juneau ---
[INFO] 
[INFO] --- apache-rat-plugin:0.11:check (default) @ juneau ---
[INFO] 57 implicit excludes (use -debug for more details).
[INFO] Exclude: **/DEPENDENCIES
[INFO] Exclude: **/target/**
[INFO] Exclude: **/.settings/**
[INFO] Exclude: **/.project
[INFO] Exclude: **/.classpath
[INFO] Exclude: **/*.launch
[INFO] Exclude: **/jetty.out.xml
[INFO] Exclude: **/dependency-reduced-pom.xml
[INFO] 12 resources included (use -debug for more details)
[INFO] Rat check: Summary of files. Unapproved: 0 unknown: 0 generated: 0 approved: 9 licence.
[INFO] 
[INFO] --- maven-install-plugin:2.5.2:install (default-install) @ juneau ---
[INFO] Installing <https://builds.apache.org/job/Juneau-Java-1.8/ws/pom.xml> to /home/jenkins/.m2/repository/org/apache/juneau/juneau/7.0.1-SNAPSHOT/juneau-7.0.1-SNAPSHOT.pom
[INFO] 
[INFO] --- maven-enforcer-plugin:1.4.1:enforce (enforce-maven) @ juneau ---
[INFO] 
[INFO] --- maven-remote-resources-plugin:1.5:process (process-resource-bundles) @ juneau ---
[INFO] 
[INFO] --- maven-site-plugin:3.5.1:attach-descriptor (attach-descriptor) @ juneau ---
[INFO] 
[INFO] --- apache-rat-plugin:0.11:check (default) @ juneau ---
[INFO] 57 implicit excludes (use -debug for more details).
[INFO] Exclude: **/DEPENDENCIES
[INFO] Exclude: **/target/**
[INFO] Exclude: **/.settings/**
[INFO] Exclude: **/.project
[INFO] Exclude: **/.classpath
[INFO] Exclude: **/*.launch
[INFO] Exclude: **/jetty.out.xml
[INFO] Exclude: **/dependency-reduced-pom.xml
[INFO] 12 resources included (use -debug for more details)
[INFO] Rat check: Summary of files. Unapproved: 0 unknown: 0 generated: 0 approved: 9 licence.
[INFO] 
[INFO] --- maven-install-plugin:2.5.2:install (default-install) @ juneau ---
[INFO] Installing <https://builds.apache.org/job/Juneau-Java-1.8/ws/pom.xml> to /home/jenkins/.m2/repository/org/apache/juneau/juneau/7.0.1-SNAPSHOT/juneau-7.0.1-SNAPSHOT.pom
[INFO] 
[INFO] --- maven-deploy-plugin:2.8.2:deploy (default-deploy) @ juneau ---
Downloading: https://repository.apache.org/content/repositories/snapshots/org/apache/juneau/juneau/7.0.1-SNAPSHOT/maven-metadata.xml
602/602 B               Downloaded: https://repository.apache.org/content/repositories/snapshots/org/apache/juneau/juneau/7.0.1-SNAPSHOT/maven-metadata.xml
(602 B at 0.5 KB/sec)
Uploading: https://repository.apache.org/content/repositories/snapshots/org/apache/juneau/juneau/7.0.1-SNAPSHOT/juneau-7.0.1-20171203.171553-15.pom
2/12 KB     4/12 KB   6/12 KB   8/12 KB   10/12 KB   12/12 KB              Uploaded: https://repository.apache.org/content/repositories/snapshots/org/apache/juneau/juneau/7.0.1-SNAPSHOT/juneau-7.0.1-20171203.171553-15.pom
(12 KB at 11.4 KB/sec)
Downloading: https://repository.apache.org/content/repositories/snapshots/org/apache/juneau/juneau/maven-metadata.xml
598/598 B               Downloaded: https://repository.apache.org/content/repositories/snapshots/org/apache/juneau/juneau/maven-metadata.xml
(598 B at 0.9 KB/sec)
Uploading: https://repository.apache.org/content/repositories/snapshots/org/apache/juneau/juneau/7.0.1-SNAPSHOT/maven-metadata.xml
602/602 B               Uploaded: https://repository.apache.org/content/repositories/snapshots/org/apache/juneau/juneau/7.0.1-SNAPSHOT/maven-metadata.xml
(602 B at 0.7 KB/sec)
Uploading: https://repository.apache.org/content/repositories/snapshots/org/apache/juneau/juneau/maven-metadata.xml
598/598 B               Uploaded: https://repository.apache.org/content/repositories/snapshots/org/apache/juneau/juneau/maven-metadata.xml
(598 B at 0.7 KB/sec)
[INFO]                                                                         
[INFO] ------------------------------------------------------------------------
[INFO] Building Apache Juneau - Core APIs 7.0.1-SNAPSHOT
[INFO] ------------------------------------------------------------------------
[INFO] 
[INFO] --- maven-clean-plugin:3.0.0:clean (default-clean) @ juneau-core ---
[INFO] Deleting <https://builds.apache.org/job/Juneau-Java-1.8/ws/juneau-core/target>
[INFO] 
[INFO] --- maven-enforcer-plugin:1.4.1:enforce (enforce-maven) @ juneau-core ---
[INFO] 
[INFO] --- maven-remote-resources-plugin:1.5:process (process-resource-bundles) @ juneau-core
---
[INFO] 
[INFO] --- maven-site-plugin:3.5.1:attach-descriptor (attach-descriptor) @ juneau-core ---
[INFO] 
[INFO] --- apache-rat-plugin:0.11:check (default) @ juneau-core ---
[INFO] 57 implicit excludes (use -debug for more details).
[INFO] Exclude: **/DEPENDENCIES
[INFO] Exclude: **/target/**
[INFO] Exclude: **/.settings/**
[INFO] Exclude: **/.project
[INFO] Exclude: **/.classpath
[INFO] Exclude: **/*.launch
[INFO] Exclude: **/jetty.out.xml
[INFO] Exclude: **/dependency-reduced-pom.xml
[INFO] 1 resources included (use -debug for more details)
[INFO] Rat check: Summary of files. Unapproved: 0 unknown: 0 generated: 0 approved: 1 licence.
[INFO] 
[INFO] --- maven-install-plugin:2.5.2:install (default-install) @ juneau-core ---
[INFO] Installing <https://builds.apache.org/job/Juneau-Java-1.8/ws/juneau-core/pom.xml>
to /home/jenkins/.m2/repository/org/apache/juneau/juneau-core/7.0.1-SNAPSHOT/juneau-core-7.0.1-SNAPSHOT.pom
[INFO] 
[INFO] --- maven-enforcer-plugin:1.4.1:enforce (enforce-maven) @ juneau-core ---
[INFO] 
[INFO] --- maven-remote-resources-plugin:1.5:process (process-resource-bundles) @ juneau-core
---
[INFO] 
[INFO] --- maven-site-plugin:3.5.1:attach-descriptor (attach-descriptor) @ juneau-core ---
[INFO] 
[INFO] --- apache-rat-plugin:0.11:check (default) @ juneau-core ---
[INFO] 57 implicit excludes (use -debug for more details).
[INFO] Exclude: **/DEPENDENCIES
[INFO] Exclude: **/target/**
[INFO] Exclude: **/.settings/**
[INFO] Exclude: **/.project
[INFO] Exclude: **/.classpath
[INFO] Exclude: **/*.launch
[INFO] Exclude: **/jetty.out.xml
[INFO] Exclude: **/dependency-reduced-pom.xml
[INFO] 1 resources included (use -debug for more details)
[INFO] Rat check: Summary of files. Unapproved: 0 unknown: 0 generated: 0 approved: 1 licence.
[INFO] 
[INFO] --- maven-install-plugin:2.5.2:install (default-install) @ juneau-core ---
[INFO] Installing <https://builds.apache.org/job/Juneau-Java-1.8/ws/juneau-core/pom.xml>
to /home/jenkins/.m2/repository/org/apache/juneau/juneau-core/7.0.1-SNAPSHOT/juneau-core-7.0.1-SNAPSHOT.pom
[INFO] 
[INFO] --- maven-deploy-plugin:2.8.2:deploy (default-deploy) @ juneau-core ---
Downloading: https://repository.apache.org/content/repositories/snapshots/org/apache/juneau/juneau-core/7.0.1-SNAPSHOT/maven-metadata.xml
607/607 B               Downloaded: https://repository.apache.org/content/repositories/snapshots/org/apache/juneau/juneau-core/7.0.1-SNAPSHOT/maven-metadata.xml
(607 B at 1.0 KB/sec)
Uploading: https://repository.apache.org/content/repositories/snapshots/org/apache/juneau/juneau-core/7.0.1-SNAPSHOT/juneau-core-7.0.1-20171203.171557-15.pom
2/3 KB      3/3 KB            Uploaded: https://repository.apache.org/content/repositories/snapshots/org/apache/juneau/juneau-core/7.0.1-SNAPSHOT/juneau-core-7.0.1-20171203.171557-15.pom
(3 KB at 2.7 KB/sec)
Downloading: https://repository.apache.org/content/repositories/snapshots/org/apache/juneau/juneau-core/maven-metadata.xml
603/603 B               Downloaded: https://repository.apache.org/content/repositories/snapshots/org/apache/juneau/juneau-core/maven-metadata.xml
(603 B at 1.0 KB/sec)
Uploading: https://repository.apache.org/content/repositories/snapshots/org/apache/juneau/juneau-core/7.0.1-SNAPSHOT/maven-metadata.xml
607/607 B               Uploaded: https://repository.apache.org/content/repositories/snapshots/org/apache/juneau/juneau-core/7.0.1-SNAPSHOT/maven-metadata.xml
(607 B at 0.7 KB/sec)
Uploading: https://repository.apache.org/content/repositories/snapshots/org/apache/juneau/juneau-core/maven-metadata.xml
603/603 B               Uploaded: https://repository.apache.org/content/repositories/snapshots/org/apache/juneau/juneau-core/maven-metadata.xml
(603 B at 0.7 KB/sec)
[INFO]                                                                         
[INFO] ------------------------------------------------------------------------
[INFO] Building Apache Juneau Marshall 7.0.1-SNAPSHOT
[INFO] ------------------------------------------------------------------------
[INFO] 
[INFO] --- maven-clean-plugin:3.0.0:clean (default-clean) @ juneau-marshall ---
[INFO] Deleting <https://builds.apache.org/job/Juneau-Java-1.8/ws/juneau-core/juneau-marshall/target>
[INFO] 
[INFO] --- maven-enforcer-plugin:1.4.1:enforce (enforce-maven) @ juneau-marshall ---
[INFO] 
[INFO] --- jacoco-maven-plugin:0.7.2.201409121644:prepare-agent (default-prepare-agent) @
juneau-marshall ---
[INFO] argLine set to -javaagent:/home/jenkins/.m2/repository/org/jacoco/org.jacoco.agent/0.7.2.201409121644/org.jacoco.agent-0.7.2.201409121644-runtime.jar=destfile=<https://builds.apache.org/job/Juneau-Java-1.8/ws/juneau-core/juneau-marshall/target/jacoco.exec>
[INFO] 
[INFO] --- maven-remote-resources-plugin:1.5:process (process-resource-bundles) @ juneau-marshall
---
[INFO] 
[INFO] --- maven-resources-plugin:2.7:resources (default-resources) @ juneau-marshall ---
[INFO] Using 'UTF-8' encoding to copy filtered resources.
[INFO] skip non existing resourceDirectory <https://builds.apache.org/job/Juneau-Java-1.8/ws/juneau-core/juneau-marshall/src/main/resources>
[INFO] Copying 3 resources
[INFO] 
[INFO] --- maven-compiler-plugin:3.5.1:compile (default-compile) @ juneau-marshall ---
[INFO] Changes detected - recompiling the module!
[INFO] Compiling 396 source files to <https://builds.apache.org/job/Juneau-Java-1.8/ws/juneau-core/juneau-marshall/target/classes>
[INFO] <https://builds.apache.org/job/Juneau-Java-1.8/ws/juneau-core/juneau-marshall/src/main/java/org/apache/juneau/internal/StringUtils.java>:
Some input files use unchecked or unsafe operations.
[INFO] <https://builds.apache.org/job/Juneau-Java-1.8/ws/juneau-core/juneau-marshall/src/main/java/org/apache/juneau/internal/StringUtils.java>:
Recompile with -Xlint:unchecked for details.
[INFO] -------------------------------------------------------------
[ERROR] COMPILATION ERROR : 
[INFO] -------------------------------------------------------------
[ERROR] <https://builds.apache.org/job/Juneau-Java-1.8/ws/juneau-core/juneau-marshall/src/main/java/org/apache/juneau/utils/Args.java>:[149,33]
cannot find symbol
  symbol:   method splitQuoted(java.lang.String)
  location: class org.apache.juneau.internal.StringUtils
[INFO] 1 error
[INFO] -------------------------------------------------------------
[INFO] ------------------------------------------------------------------------
[INFO] Reactor Summary:
[INFO] 
[INFO] Apache Juneau ...................................... SUCCESS [ 12.093 s]
[INFO] Apache Juneau - Core APIs .......................... SUCCESS [  4.495 s]
[INFO] Apache Juneau Marshall ............................. FAILURE [ 12.381 s]
[INFO] Apache Juneau Marshal RDF .......................... SKIPPED
[INFO] Apache Juneau Data Transfer Objects ................ SKIPPED
[INFO] Apache Juneau Core ................................. SKIPPED
[INFO] Apache Juneau Config File API ...................... SKIPPED
[INFO] Apache Juneau Core Tests ........................... SKIPPED
[INFO] Apache Juneau - REST APIs .......................... SKIPPED
[INFO] Apache Juneau REST Servlet API ..................... SKIPPED
[INFO] Apache Juneau REST JAX/RS API ...................... SKIPPED
[INFO] Apache Juneau REST Client API ...................... SKIPPED
[INFO] Apache Juneau - Microservice APIs .................. SKIPPED
[INFO] Apache Juneau Microservice Server .................. SKIPPED
[INFO] Apache Juneau Microservice Template ................ SKIPPED
[INFO] Apache Juneau - Examples ........................... SKIPPED
[INFO] Apache Juneau REST Examples ........................ SKIPPED
[INFO] Apache Juneau Microservice Tests ................... SKIPPED
[INFO] Apache Juneau Core Examples ........................ SKIPPED
[INFO] Apache Juneau Javadocs ............................. SKIPPED
[INFO] Apache Juneau - Release Engineering ................ SKIPPED
[INFO] Apache Juneau UberJar .............................. SKIPPED
[INFO] Apache Juneau Distribution ......................... SKIPPED
[INFO] ------------------------------------------------------------------------
[INFO] BUILD FAILURE
[INFO] ------------------------------------------------------------------------
[INFO] Total time: 31.993 s
[INFO] Finished at: 2017-12-03T17:16:13+00:00
[INFO] Final Memory: 44M/995M
[INFO] ------------------------------------------------------------------------
[ERROR] Failed to execute goal org.apache.maven.plugins:maven-compiler-plugin:3.5.1:compile
(default-compile) on project juneau-marshall: Compilation failure
[ERROR] <https://builds.apache.org/job/Juneau-Java-1.8/ws/juneau-core/juneau-marshall/src/main/java/org/apache/juneau/utils/Args.java>:[149,33]
cannot find symbol
[ERROR] symbol:   method splitQuoted(java.lang.String)
[ERROR] location: class org.apache.juneau.internal.StringUtils
[ERROR] -> [Help 1]
[ERROR] 
[ERROR] To see the full stack trace of the errors, re-run Maven with the -e switch.
[ERROR] Re-run Maven using the -X switch to enable full debug logging.
[ERROR] 
[ERROR] For more information about the errors and possible solutions, please read the following
articles:
[ERROR] [Help 1] http://cwiki.apache.org/confluence/display/MAVEN/MojoFailureException
[ERROR] 
[ERROR] After correcting the problems, you can resume the build with the command
[ERROR]   mvn <goals> -rf :juneau-marshall
Build step 'Invoke top-level Maven targets' marked build as failure

Mime
View raw message