juneau-dev mailing list archives

Site index · List index
Message view « Date » · « Thread »
Top « Date » · « Thread »
From Apache Jenkins Server <jenk...@builds.apache.org>
Subject Build failed in Jenkins: Juneau-Java-1.8 #596
Date Sat, 23 Dec 2017 17:14:18 GMT
See <https://builds.apache.org/job/Juneau-Java-1.8/596/display/redirect?page=changes>

Changes:

[jamesbognar] (JUNEAU-76) Improvements to Context/Builder APIs

------------------------------------------
[...truncated 316.52 KB...]
[INFO] --- maven-surefire-plugin:2.19.1:test (default-test) @ juneau-microservice-template
---
[INFO] 
[INFO] --- maven-jar-plugin:3.0.0:jar (default-jar) @ juneau-microservice-template ---
[INFO] Building jar: <https://builds.apache.org/job/Juneau-Java-1.8/ws/juneau-microservice/juneau-microservice-template/target/juneau-microservice-template-7.0.2-SNAPSHOT.jar>
[INFO] 
[INFO] --- maven-site-plugin:3.5.1:attach-descriptor (attach-descriptor) @ juneau-microservice-template
---
[INFO] 
[INFO] --- maven-assembly-plugin:2.6:single (juneau-assembly) @ juneau-microservice-template
---
[INFO] Reading assembly descriptor: src/assembly/bin.xml
[WARNING] The assembly descriptor contains a filesystem-root relative reference, which is
not cross platform compatible /
[INFO] Building zip: <https://builds.apache.org/job/Juneau-Java-1.8/ws/juneau-microservice/juneau-microservice-template/target/my-microservice-7.0.2-SNAPSHOT-bin.zip>
[INFO] 
[INFO] --- apache-rat-plugin:0.11:check (default) @ juneau-microservice-template ---
[INFO] 51 implicit excludes (use -debug for more details).
[INFO] Exclude: **/DEPENDENCIES
[INFO] Exclude: **/target/**
[INFO] Exclude: **/.settings/**
[INFO] Exclude: **/.project
[INFO] Exclude: **/.classpath
[INFO] Exclude: **/*.launch
[INFO] Exclude: **/jetty.out.xml
[INFO] Exclude: **/dependency-reduced-pom.xml
[INFO] 10 resources included (use -debug for more details)
[INFO] Rat check: Summary of files. Unapproved: 0 unknown: 0 generated: 0 approved: 10 licence.
[INFO] 
[INFO] --- maven-install-plugin:2.5.2:install (default-install) @ juneau-microservice-template
---
[INFO] Installing <https://builds.apache.org/job/Juneau-Java-1.8/ws/juneau-microservice/juneau-microservice-template/target/juneau-microservice-template-7.0.2-SNAPSHOT.jar>
to /home/jenkins/.m2/repository/org/apache/juneau/juneau-microservice-template/7.0.2-SNAPSHOT/juneau-microservice-template-7.0.2-SNAPSHOT.jar
[INFO] Installing <https://builds.apache.org/job/Juneau-Java-1.8/ws/juneau-microservice/juneau-microservice-template/pom.xml>
to /home/jenkins/.m2/repository/org/apache/juneau/juneau-microservice-template/7.0.2-SNAPSHOT/juneau-microservice-template-7.0.2-SNAPSHOT.pom
[INFO] Installing <https://builds.apache.org/job/Juneau-Java-1.8/ws/juneau-microservice/juneau-microservice-template/target/my-microservice-7.0.2-SNAPSHOT-bin.zip>
to /home/jenkins/.m2/repository/org/apache/juneau/juneau-microservice-template/7.0.2-SNAPSHOT/juneau-microservice-template-7.0.2-SNAPSHOT-bin.zip
[INFO] 
[INFO] --- maven-enforcer-plugin:1.4.1:enforce (enforce-maven) @ juneau-microservice-template
---
[INFO] 
[INFO] --- maven-remote-resources-plugin:1.5:process (process-resource-bundles) @ juneau-microservice-template
---
[INFO] 
[INFO] --- maven-resources-plugin:2.7:resources (default-resources) @ juneau-microservice-template
---
[INFO] Using 'UTF-8' encoding to copy filtered resources.
[INFO] skip non existing resourceDirectory <https://builds.apache.org/job/Juneau-Java-1.8/ws/juneau-microservice/juneau-microservice-template/src/main/resources>
[INFO] Copying 3 resources
[INFO] Copying 3 resources
[INFO] 
[INFO] --- maven-compiler-plugin:3.5.1:compile (default-compile) @ juneau-microservice-template
---
[INFO] Nothing to compile - all classes are up to date
[INFO] 
[INFO] --- maven-resources-plugin:2.7:testResources (default-testResources) @ juneau-microservice-template
---
[INFO] Using 'UTF-8' encoding to copy filtered resources.
[INFO] skip non existing resourceDirectory <https://builds.apache.org/job/Juneau-Java-1.8/ws/juneau-microservice/juneau-microservice-template/src/test/resources>
[INFO] Copying 3 resources
[INFO] Copying 3 resources
[INFO] 
[INFO] --- maven-compiler-plugin:3.5.1:testCompile (default-testCompile) @ juneau-microservice-template
---
[INFO] No sources to compile
[INFO] 
[INFO] --- maven-surefire-plugin:2.19.1:test (default-test) @ juneau-microservice-template
---
[INFO] Skipping execution of surefire because it has already been run for this configuration
[INFO] 
[INFO] --- maven-jar-plugin:3.0.0:jar (default-jar) @ juneau-microservice-template ---
[INFO] 
[INFO] --- maven-site-plugin:3.5.1:attach-descriptor (attach-descriptor) @ juneau-microservice-template
---
[INFO] 
[INFO] --- maven-assembly-plugin:2.6:single (juneau-assembly) @ juneau-microservice-template
---
[INFO] Reading assembly descriptor: src/assembly/bin.xml
[WARNING] The assembly descriptor contains a filesystem-root relative reference, which is
not cross platform compatible /
[INFO] Building zip: <https://builds.apache.org/job/Juneau-Java-1.8/ws/juneau-microservice/juneau-microservice-template/target/my-microservice-7.0.2-SNAPSHOT-bin.zip>
[INFO] 
[INFO] --- apache-rat-plugin:0.11:check (default) @ juneau-microservice-template ---
[INFO] 51 implicit excludes (use -debug for more details).
[INFO] Exclude: **/DEPENDENCIES
[INFO] Exclude: **/target/**
[INFO] Exclude: **/.settings/**
[INFO] Exclude: **/.project
[INFO] Exclude: **/.classpath
[INFO] Exclude: **/*.launch
[INFO] Exclude: **/jetty.out.xml
[INFO] Exclude: **/dependency-reduced-pom.xml
[INFO] 10 resources included (use -debug for more details)
[INFO] Rat check: Summary of files. Unapproved: 0 unknown: 0 generated: 0 approved: 10 licence.
[INFO] 
[INFO] --- maven-install-plugin:2.5.2:install (default-install) @ juneau-microservice-template
---
[INFO] Installing <https://builds.apache.org/job/Juneau-Java-1.8/ws/juneau-microservice/juneau-microservice-template/target/juneau-microservice-template-7.0.2-SNAPSHOT.jar>
to /home/jenkins/.m2/repository/org/apache/juneau/juneau-microservice-template/7.0.2-SNAPSHOT/juneau-microservice-template-7.0.2-SNAPSHOT.jar
[INFO] Installing <https://builds.apache.org/job/Juneau-Java-1.8/ws/juneau-microservice/juneau-microservice-template/pom.xml>
to /home/jenkins/.m2/repository/org/apache/juneau/juneau-microservice-template/7.0.2-SNAPSHOT/juneau-microservice-template-7.0.2-SNAPSHOT.pom
[INFO] Installing <https://builds.apache.org/job/Juneau-Java-1.8/ws/juneau-microservice/juneau-microservice-template/target/my-microservice-7.0.2-SNAPSHOT-bin.zip>
to /home/jenkins/.m2/repository/org/apache/juneau/juneau-microservice-template/7.0.2-SNAPSHOT/juneau-microservice-template-7.0.2-SNAPSHOT-bin.zip
[INFO] Installing <https://builds.apache.org/job/Juneau-Java-1.8/ws/juneau-microservice/juneau-microservice-template/target/my-microservice-7.0.2-SNAPSHOT-bin.zip>
to /home/jenkins/.m2/repository/org/apache/juneau/juneau-microservice-template/7.0.2-SNAPSHOT/juneau-microservice-template-7.0.2-SNAPSHOT-bin.zip
[INFO] 
[INFO] --- maven-deploy-plugin:2.8.2:deploy (default-deploy) @ juneau-microservice-template
---
Downloading: https://repository.apache.org/content/repositories/snapshots/org/apache/juneau/juneau-microservice-template/7.0.2-SNAPSHOT/maven-metadata.xml
1005/1005 B                 Downloaded: https://repository.apache.org/content/repositories/snapshots/org/apache/juneau/juneau-microservice-template/7.0.2-SNAPSHOT/maven-metadata.xml
(1005 B at 2.1 KB/sec)
Uploading: https://repository.apache.org/content/repositories/snapshots/org/apache/juneau/juneau-microservice-template/7.0.2-SNAPSHOT/juneau-microservice-template-7.0.2-20171223.171404-7.jar
2/10 KB       4/10 KB   6/10 KB   8/10 KB   10/10 KB              Uploaded: https://repository.apache.org/content/repositories/snapshots/org/apache/juneau/juneau-microservice-template/7.0.2-SNAPSHOT/juneau-microservice-template-7.0.2-20171223.171404-7.jar
(10 KB at 14.3 KB/sec)
Uploading: https://repository.apache.org/content/repositories/snapshots/org/apache/juneau/juneau-microservice-template/7.0.2-SNAPSHOT/juneau-microservice-template-7.0.2-20171223.171404-7.pom
2/4 KB     4/4 KB            Uploaded: https://repository.apache.org/content/repositories/snapshots/org/apache/juneau/juneau-microservice-template/7.0.2-SNAPSHOT/juneau-microservice-template-7.0.2-20171223.171404-7.pom
(4 KB at 5.2 KB/sec)
Downloading: https://repository.apache.org/content/repositories/snapshots/org/apache/juneau/juneau-microservice-template/maven-metadata.xml
507/507 B               Downloaded: https://repository.apache.org/content/repositories/snapshots/org/apache/juneau/juneau-microservice-template/maven-metadata.xml
(507 B at 1.1 KB/sec)
Uploading: https://repository.apache.org/content/repositories/snapshots/org/apache/juneau/juneau-microservice-template/7.0.2-SNAPSHOT/maven-metadata.xml
1005/1005 B                 Uploaded: https://repository.apache.org/content/repositories/snapshots/org/apache/juneau/juneau-microservice-template/7.0.2-SNAPSHOT/maven-metadata.xml
(1005 B at 1.4 KB/sec)
Uploading: https://repository.apache.org/content/repositories/snapshots/org/apache/juneau/juneau-microservice-template/maven-metadata.xml
507/507 B                 Uploaded: https://repository.apache.org/content/repositories/snapshots/org/apache/juneau/juneau-microservice-template/maven-metadata.xml
(507 B at 0.7 KB/sec)
Uploading: https://repository.apache.org/content/repositories/snapshots/org/apache/juneau/juneau-microservice-template/7.0.2-SNAPSHOT/juneau-microservice-template-7.0.2-20171223.171404-7-bin.zip
2/19 KB     4/19 KB   6/19 KB   8/19 KB   10/19 KB   12/19 KB   14/19 KB   16/19 KB   18/19
KB   19/19 KB              Uploaded: https://repository.apache.org/content/repositories/snapshots/org/apache/juneau/juneau-microservice-template/7.0.2-SNAPSHOT/juneau-microservice-template-7.0.2-20171223.171404-7-bin.zip
(19 KB at 24.7 KB/sec)
Uploading: https://repository.apache.org/content/repositories/snapshots/org/apache/juneau/juneau-microservice-template/7.0.2-SNAPSHOT/maven-metadata.xml
1005/1005 B                 Uploaded: https://repository.apache.org/content/repositories/snapshots/org/apache/juneau/juneau-microservice-template/7.0.2-SNAPSHOT/maven-metadata.xml
(1005 B at 1.4 KB/sec)
Uploading: https://repository.apache.org/content/repositories/snapshots/org/apache/juneau/juneau-microservice-template/7.0.2-SNAPSHOT/juneau-microservice-template-7.0.2-20171223.171404-7-bin.zip
2/19 KB       4/19 KB   6/19 KB   8/19 KB   10/19 KB   12/19 KB   14/19 KB   16/19 KB   18/19
KB   19/19 KB              Uploaded: https://repository.apache.org/content/repositories/snapshots/org/apache/juneau/juneau-microservice-template/7.0.2-SNAPSHOT/juneau-microservice-template-7.0.2-20171223.171404-7-bin.zip
(19 KB at 24.4 KB/sec)
Uploading: https://repository.apache.org/content/repositories/snapshots/org/apache/juneau/juneau-microservice-template/7.0.2-SNAPSHOT/maven-metadata.xml
1005/1005 B                 Uploaded: https://repository.apache.org/content/repositories/snapshots/org/apache/juneau/juneau-microservice-template/7.0.2-SNAPSHOT/maven-metadata.xml
(1005 B at 1.4 KB/sec)
[INFO]                                                                         
[INFO] ------------------------------------------------------------------------
[INFO] Building Apache Juneau - Examples 7.0.2-SNAPSHOT
[INFO] ------------------------------------------------------------------------
[INFO] 
[INFO] --- maven-clean-plugin:3.0.0:clean (default-clean) @ juneau-examples ---
[INFO] Deleting <https://builds.apache.org/job/Juneau-Java-1.8/ws/juneau-examples/target>
[INFO] 
[INFO] --- maven-enforcer-plugin:1.4.1:enforce (enforce-maven) @ juneau-examples ---
[INFO] 
[INFO] --- maven-remote-resources-plugin:1.5:process (process-resource-bundles) @ juneau-examples
---
[INFO] 
[INFO] --- maven-site-plugin:3.5.1:attach-descriptor (attach-descriptor) @ juneau-examples
---
[INFO] 
[INFO] --- apache-rat-plugin:0.11:check (default) @ juneau-examples ---
[INFO] 53 implicit excludes (use -debug for more details).
[INFO] Exclude: **/DEPENDENCIES
[INFO] Exclude: **/target/**
[INFO] Exclude: **/.settings/**
[INFO] Exclude: **/.project
[INFO] Exclude: **/.classpath
[INFO] Exclude: **/*.launch
[INFO] Exclude: **/jetty.out.xml
[INFO] Exclude: **/dependency-reduced-pom.xml
[INFO] 1 resources included (use -debug for more details)
[INFO] Rat check: Summary of files. Unapproved: 0 unknown: 0 generated: 0 approved: 1 licence.
[INFO] 
[INFO] --- maven-install-plugin:2.5.2:install (default-install) @ juneau-examples ---
[INFO] Installing <https://builds.apache.org/job/Juneau-Java-1.8/ws/juneau-examples/pom.xml>
to /home/jenkins/.m2/repository/org/apache/juneau/juneau-examples/7.0.2-SNAPSHOT/juneau-examples-7.0.2-SNAPSHOT.pom
[INFO] 
[INFO] --- maven-enforcer-plugin:1.4.1:enforce (enforce-maven) @ juneau-examples ---
[INFO] 
[INFO] --- maven-remote-resources-plugin:1.5:process (process-resource-bundles) @ juneau-examples
---
[INFO] 
[INFO] --- maven-site-plugin:3.5.1:attach-descriptor (attach-descriptor) @ juneau-examples
---
[INFO] 
[INFO] --- apache-rat-plugin:0.11:check (default) @ juneau-examples ---
[INFO] 53 implicit excludes (use -debug for more details).
[INFO] Exclude: **/DEPENDENCIES
[INFO] Exclude: **/target/**
[INFO] Exclude: **/.settings/**
[INFO] Exclude: **/.project
[INFO] Exclude: **/.classpath
[INFO] Exclude: **/*.launch
[INFO] Exclude: **/jetty.out.xml
[INFO] Exclude: **/dependency-reduced-pom.xml
[INFO] 1 resources included (use -debug for more details)
[INFO] Rat check: Summary of files. Unapproved: 0 unknown: 0 generated: 0 approved: 1 licence.
[INFO] 
[INFO] --- maven-install-plugin:2.5.2:install (default-install) @ juneau-examples ---
[INFO] Installing <https://builds.apache.org/job/Juneau-Java-1.8/ws/juneau-examples/pom.xml>
to /home/jenkins/.m2/repository/org/apache/juneau/juneau-examples/7.0.2-SNAPSHOT/juneau-examples-7.0.2-SNAPSHOT.pom
[INFO] 
[INFO] --- maven-deploy-plugin:2.8.2:deploy (default-deploy) @ juneau-examples ---
Downloading: https://repository.apache.org/content/repositories/snapshots/org/apache/juneau/juneau-examples/7.0.2-SNAPSHOT/maven-metadata.xml
609/609 B                 Downloaded: https://repository.apache.org/content/repositories/snapshots/org/apache/juneau/juneau-examples/7.0.2-SNAPSHOT/maven-metadata.xml
(609 B at 1.4 KB/sec)
Uploading: https://repository.apache.org/content/repositories/snapshots/org/apache/juneau/juneau-examples/7.0.2-SNAPSHOT/juneau-examples-7.0.2-20171223.171410-7.pom
2/3 KB      3/3 KB            Uploaded: https://repository.apache.org/content/repositories/snapshots/org/apache/juneau/juneau-examples/7.0.2-SNAPSHOT/juneau-examples-7.0.2-20171223.171410-7.pom
(3 KB at 3.1 KB/sec)
Downloading: https://repository.apache.org/content/repositories/snapshots/org/apache/juneau/juneau-examples/maven-metadata.xml
545/545 B               Downloaded: https://repository.apache.org/content/repositories/snapshots/org/apache/juneau/juneau-examples/maven-metadata.xml
(545 B at 1.2 KB/sec)
Uploading: https://repository.apache.org/content/repositories/snapshots/org/apache/juneau/juneau-examples/7.0.2-SNAPSHOT/maven-metadata.xml
609/609 B               Uploaded: https://repository.apache.org/content/repositories/snapshots/org/apache/juneau/juneau-examples/7.0.2-SNAPSHOT/maven-metadata.xml
(609 B at 0.9 KB/sec)
Uploading: https://repository.apache.org/content/repositories/snapshots/org/apache/juneau/juneau-examples/maven-metadata.xml
545/545 B               Uploaded: https://repository.apache.org/content/repositories/snapshots/org/apache/juneau/juneau-examples/maven-metadata.xml
(545 B at 0.8 KB/sec)
[INFO]                                                                         
[INFO] ------------------------------------------------------------------------
[INFO] Building Apache Juneau REST Examples 7.0.2-SNAPSHOT
[INFO] ------------------------------------------------------------------------
[INFO] 
[INFO] --- maven-clean-plugin:3.0.0:clean (default-clean) @ juneau-examples-rest ---
[INFO] Deleting <https://builds.apache.org/job/Juneau-Java-1.8/ws/juneau-examples/juneau-examples-rest/target>
[INFO] 
[INFO] --- maven-enforcer-plugin:1.4.1:enforce (enforce-maven) @ juneau-examples-rest ---
[INFO] 
[INFO] --- maven-remote-resources-plugin:1.5:process (process-resource-bundles) @ juneau-examples-rest
---
[INFO] 
[INFO] --- maven-resources-plugin:2.7:resources (default-resources) @ juneau-examples-rest
---
[INFO] Using 'UTF-8' encoding to copy filtered resources.
[INFO] Copying 18 resources
[INFO] Copying 3 resources
[INFO] 
[INFO] --- maven-compiler-plugin:3.5.1:compile (default-compile) @ juneau-examples-rest ---
[INFO] Changes detected - recompiling the module!
[INFO] Compiling 28 source files to <https://builds.apache.org/job/Juneau-Java-1.8/ws/juneau-examples/juneau-examples-rest/target/classes>
[INFO] -------------------------------------------------------------
[ERROR] COMPILATION ERROR : 
[INFO] -------------------------------------------------------------
[ERROR] <https://builds.apache.org/job/Juneau-Java-1.8/ws/juneau-examples/juneau-examples-rest/src/main/java/org/apache/juneau/examples/rest/PhotosResource.java>:[138,40]
cannot find symbol
  symbol:   class PropertyStore2
  location: class org.apache.juneau.examples.rest.PhotosResource.ImageSerializer
[ERROR] <https://builds.apache.org/job/Juneau-Java-1.8/ws/juneau-examples/juneau-examples-rest/src/main/java/org/apache/juneau/examples/rest/PhotosResource.java>:[163,36]
cannot find symbol
  symbol:   class PropertyStore2
  location: class org.apache.juneau.examples.rest.PhotosResource.ImageParser
[INFO] 2 errors 
[INFO] -------------------------------------------------------------
[INFO] ------------------------------------------------------------------------
[INFO] Reactor Summary:
[INFO] 
[INFO] Apache Juneau ...................................... SUCCESS [  6.154 s]
[INFO] Apache Juneau - Core APIs .......................... SUCCESS [  3.296 s]
[INFO] Apache Juneau Marshall ............................. SUCCESS [ 23.249 s]
[INFO] Apache Juneau Marshal RDF .......................... SUCCESS [  9.312 s]
[INFO] Apache Juneau Data Transfer Objects ................ SUCCESS [ 11.028 s]
[INFO] Apache Juneau Core ................................. SUCCESS [  8.186 s]
[INFO] Apache Juneau Config File API ...................... SUCCESS [  8.706 s]
[INFO] Apache Juneau Core Tests ........................... SUCCESS [ 32.948 s]
[INFO] Apache Juneau - REST APIs .......................... SUCCESS [  3.061 s]
[INFO] Apache Juneau REST Servlet API ..................... SUCCESS [ 10.781 s]
[INFO] Apache Juneau REST JAX/RS API ...................... SUCCESS [  7.896 s]
[INFO] Apache Juneau REST Client API ...................... SUCCESS [  8.560 s]
[INFO] Apache Juneau - Microservice APIs .................. SUCCESS [  3.080 s]
[INFO] Apache Juneau Microservice Server .................. SUCCESS [  9.034 s]
[INFO] Apache Juneau Microservice Template ................ SUCCESS [  7.549 s]
[INFO] Apache Juneau - Examples ........................... SUCCESS [  3.042 s]
[INFO] Apache Juneau REST Examples ........................ FAILURE [  0.484 s]
[INFO] Apache Juneau Microservice Tests ................... SKIPPED
[INFO] Apache Juneau Core Examples ........................ SKIPPED
[INFO] Apache Juneau Javadocs ............................. SKIPPED
[INFO] Apache Juneau - Release Engineering ................ SKIPPED
[INFO] Apache Juneau UberJar .............................. SKIPPED
[INFO] Apache Juneau Distribution ......................... SKIPPED
[INFO] ------------------------------------------------------------------------
[INFO] BUILD FAILURE
[INFO] ------------------------------------------------------------------------
[INFO] Total time: 02:37 min
[INFO] Finished at: 2017-12-23T17:14:13+00:00
[INFO] Final Memory: 76M/2238M
[INFO] ------------------------------------------------------------------------
[ERROR] Failed to execute goal org.apache.maven.plugins:maven-compiler-plugin:3.5.1:compile
(default-compile) on project juneau-examples-rest: Compilation failure: Compilation failure:
[ERROR] <https://builds.apache.org/job/Juneau-Java-1.8/ws/juneau-examples/juneau-examples-rest/src/main/java/org/apache/juneau/examples/rest/PhotosResource.java>:[138,40]
cannot find symbol
[ERROR] symbol:   class PropertyStore2
[ERROR] location: class org.apache.juneau.examples.rest.PhotosResource.ImageSerializer
[ERROR] <https://builds.apache.org/job/Juneau-Java-1.8/ws/juneau-examples/juneau-examples-rest/src/main/java/org/apache/juneau/examples/rest/PhotosResource.java>:[163,36]
cannot find symbol
[ERROR] symbol:   class PropertyStore2
[ERROR] location: class org.apache.juneau.examples.rest.PhotosResource.ImageParser
[ERROR] -> [Help 1]
[ERROR] 
[ERROR] To see the full stack trace of the errors, re-run Maven with the -e switch.
[ERROR] Re-run Maven using the -X switch to enable full debug logging.
[ERROR] 
[ERROR] For more information about the errors and possible solutions, please read the following
articles:
[ERROR] [Help 1] http://cwiki.apache.org/confluence/display/MAVEN/MojoFailureException
[ERROR] 
[ERROR] After correcting the problems, you can resume the build with the command
[ERROR]   mvn <goals> -rf :juneau-examples-rest
Build step 'Invoke top-level Maven targets' marked build as failure

Mime
View raw message