juneau-dev mailing list archives

Site index · List index
Message view « Date » · « Thread »
Top « Date » · « Thread »
From David Goddard <godd...@acm.org>
Subject Re: [VOTE] Release Apache Juneau 7.0.0 RC1
Date Mon, 23 Oct 2017 16:33:02 GMT
I think it might be IBM that deserves the blame rather than Windows in 
this case.  I repeated the test on the same platform, having switched 
the JDK to Oracle's:

[INFO] 
------------------------------------------------------------------------
[INFO] Reactor Summary:
[INFO]
[INFO] Apache Juneau ...................................... SUCCESS [ 
2.153 s]
[INFO] Apache Juneau - Core APIs .......................... SUCCESS [ 
0.203 s]
[INFO] Apache Juneau Marshall ............................. SUCCESS [ 
8.466 s]
[INFO] Apache Juneau Marshal RDF .......................... SUCCESS [ 
0.811 s]
[INFO] Apache Juneau Data Transfer Objects ................ SUCCESS [ 
1.778 s]
[INFO] Apache Juneau Core ................................. SUCCESS [ 
0.408 s]
[INFO] Apache Juneau Config File API ...................... SUCCESS [ 
0.951 s]
[INFO] Apache Juneau Core Tests ........................... SUCCESS [ 
20.982 s]
[INFO] Apache Juneau - REST APIs .......................... SUCCESS [ 
0.109 s]
[INFO] Apache Juneau REST Servlet API ..................... SUCCESS [ 
1.476 s]
[INFO] Apache Juneau REST JAX/RS API ...................... SUCCESS [ 
0.533 s]
[INFO] Apache Juneau REST Client API ...................... SUCCESS [ 
1.139 s]
[INFO] Apache Juneau - Microservice APIs .................. SUCCESS [ 
0.078 s]
[INFO] Apache Juneau Microservice Server .................. SUCCESS [ 
0.998 s]
[INFO] Apache Juneau Microservice Template ................ SUCCESS [ 
1.763 s]
[INFO] Apache Juneau - Examples ........................... SUCCESS [ 
0.078 s]
[INFO] Apache Juneau REST Examples ........................ SUCCESS [ 
7.979 s]
[INFO] Apache Juneau Microservice Tests ................... SUCCESS [ 
24.086 s]
[INFO] Apache Juneau Core Examples ........................ SUCCESS [ 
0.312 s]
[INFO] Apache Juneau Javadocs ............................. SUCCESS [ 
0.468 s]
[INFO] Apache Juneau - Release Engineering ................ SUCCESS [ 
0.078 s]
[INFO] Apache Juneau UberJar .............................. SUCCESS [ 
1.435 s]
[INFO] Apache Juneau Distribution ......................... SUCCESS [ 
0.749 s]
[INFO] 
------------------------------------------------------------------------
[INFO] BUILD SUCCESS
[INFO] 
------------------------------------------------------------------------
[INFO] Total time: 01:18 min
[INFO] Finished at: 2017-10-23T18:29:04+02:00
[INFO] Final Memory: 70M/825M
[INFO] 
------------------------------------------------------------------------

D:\ASF\juneau\release_candidates\juneau-7.0.0>java -version
java version "1.8.0_152"
Java(TM) SE Runtime Environment (build 1.8.0_152-b16)
Java HotSpot(TM) 64-Bit Server VM (build 25.152-b16, mixed mode)

So I think this is an IBM Java issue rather than a Juneau issue.

 > For the Git repo, did you use the Apache repo or the GitHub mirror?

I used the Github mirror in this case.

David


On 23/10/2017 18:26, James Bognar wrote:
> Ugh....why does Java on Windows give us so much grief around localization?
> In this case, all we're doing is the following...
> 
> DateFormat.getDateInstance(DateFormat.FULL,
> Locale.JAPAN).parse("2001年3月3日");
> 
> This is probably the mirror of the problem we were having on Windows where
> we stripped off " (xxx)" from the generated calendar strings.  I guess the
> parser doesn't like it missing.
> 
> 
> For the Git repo, did you use the Apache repo or the GitHub mirror?  It
> looks like the GitHub mirror is still pointing to the incubator repos.
> I've reopened
> https://issues.apache.org/jira/projects/INFRA/issues/INFRA-15316 .
> 
> On Mon, Oct 23, 2017 at 11:54 AM, David Goddard <goddard@acm.org> wrote:
> 
>> Hi,
>>
>> Apologies, this is indeed against the git repo.  I can confirm neither of
>> the two issues are present in the release candidate.
>>
>> Checksums valid for the RC; build is OK on MacOS platform.
>>
>> I'm having some problems with Windows though - again with localised
>> strings.  These build errors seem to affect Japanese and Korean date
>> tests.  I'll look into what in my environment could be causing it.
>>
>> However, I don't think this is an impediment to release so I'll give my +1.
>>
>> David
>>
>> Tests run: 460, Failures: 0, Errors: 16, Skipped: 0, Time elapsed: 0.273
>> sec <<< FAILURE! - in org.apache.juneau.transforms.LocalizedDatesTest
>> test[111](org.apache.juneau.transforms.LocalizedDatesTest)  Time elapsed:
>> 0.005 sec  <<< ERROR!
>> org.apache.juneau.InvalidDataConversionException: Invalid data conversion
>> from type 'java.lang.String' to type 'java.util.GregorianCalendar'.
>> Value='2001?3?3?'.
>>          at org.apache.juneau.transforms.LocalizedDatesTest.test(Localiz
>> edDatesTest.java:648)
>> Caused by: java.text.ParseException: Unparseable date: "2001?3?3?"
>>          at org.apache.juneau.transforms.LocalizedDatesTest.test(Localiz
>> edDatesTest.java:648)
>>
>> test[112](org.apache.juneau.transforms.LocalizedDatesTest)  Time elapsed:
>> 0.001 sec  <<< ERROR!
>> org.apache.juneau.InvalidDataConversionException: Invalid data conversion
>> from type 'java.lang.String' to type 'java.util.GregorianCalendar'.
>> Value='2001?3?3?'.
>>          at org.apache.juneau.transforms.LocalizedDatesTest.test(Localiz
>> edDatesTest.java:648)
>> Caused by: java.text.ParseException: Unparseable date: "2001?3?3?"
>>          at org.apache.juneau.transforms.LocalizedDatesTest.test(Localiz
>> edDatesTest.java:648)
>>
>> test[113](org.apache.juneau.transforms.LocalizedDatesTest)  Time elapsed:
>> 0 sec  <<< ERROR!
>> org.apache.juneau.InvalidDataConversionException: Invalid data conversion
>> from type 'java.lang.String' to type 'java.util.GregorianCalendar'.
>> Value='2001?3?3?'.
>>          at org.apache.juneau.transforms.LocalizedDatesTest.test(Localiz
>> edDatesTest.java:648)
>> Caused by: java.text.ParseException: Unparseable date: "2001?3?3?"
>>          at org.apache.juneau.transforms.LocalizedDatesTest.test(Localiz
>> edDatesTest.java:648)
>>
>> test[114](org.apache.juneau.transforms.LocalizedDatesTest)  Time elapsed:
>> 0.002 sec  <<< ERROR!
>> org.apache.juneau.InvalidDataConversionException: Invalid data conversion
>> from type 'java.lang.String' to type 'java.util.GregorianCalendar'.
>> Value='2001?3?3?'.
>>          at org.apache.juneau.transforms.LocalizedDatesTest.test(Localiz
>> edDatesTest.java:648)
>> Caused by: java.text.ParseException: Unparseable date: "2001?3?3?"
>>          at org.apache.juneau.transforms.LocalizedDatesTest.test(Localiz
>> edDatesTest.java:648)
>>
>> test[191](org.apache.juneau.transforms.LocalizedDatesTest)  Time elapsed:
>> 0.001 sec  <<< ERROR!
>> org.apache.juneau.InvalidDataConversionException: Invalid data conversion
>> from type 'java.lang.String' to type 'java.util.GregorianCalendar'.
>> Value='2001?3?3? 10?11?12? GMT'.
>>          at org.apache.juneau.transforms.LocalizedDatesTest.test(Localiz
>> edDatesTest.java:648)
>> Caused by: java.text.ParseException: Unparseable date: "2001?3?3?
>> 10?11?12? GMT"
>>          at org.apache.juneau.transforms.LocalizedDatesTest.test(Localiz
>> edDatesTest.java:648)
>>
>> test[192](org.apache.juneau.transforms.LocalizedDatesTest)  Time elapsed:
>> 0 sec  <<< ERROR!
>> org.apache.juneau.InvalidDataConversionException: Invalid data conversion
>> from type 'java.lang.String' to type 'java.util.GregorianCalendar'.
>> Value='2001?3?3? 10?11?12? GMT'.
>>          at org.apache.juneau.transforms.LocalizedDatesTest.test(Localiz
>> edDatesTest.java:648)
>> Caused by: java.text.ParseException: Unparseable date: "2001?3?3?
>> 10?11?12? GMT"
>>          at org.apache.juneau.transforms.LocalizedDatesTest.test(Localiz
>> edDatesTest.java:648)
>>
>> test[193](org.apache.juneau.transforms.LocalizedDatesTest)  Time elapsed:
>> 0 sec  <<< ERROR!
>> org.apache.juneau.InvalidDataConversionException: Invalid data conversion
>> from type 'java.lang.String' to type 'java.util.GregorianCalendar'.
>> Value='2001?3?3? 10?11?12? GMT'.
>>          at org.apache.juneau.transforms.LocalizedDatesTest.test(Localiz
>> edDatesTest.java:648)
>> Caused by: java.text.ParseException: Unparseable date: "2001?3?3?
>> 10?11?12? GMT"
>>          at org.apache.juneau.transforms.LocalizedDatesTest.test(Localiz
>> edDatesTest.java:648)
>>
>> test[194](org.apache.juneau.transforms.LocalizedDatesTest)  Time elapsed:
>> 0.001 sec  <<< ERROR!
>> org.apache.juneau.InvalidDataConversionException: Invalid data conversion
>> from type 'java.lang.String' to type 'java.util.GregorianCalendar'.
>> Value='2001?3?3? 10?11?12? GMT'.
>>          at org.apache.juneau.transforms.LocalizedDatesTest.test(Localiz
>> edDatesTest.java:648)
>> Caused by: java.text.ParseException: Unparseable date: "2001?3?3?
>> 10?11?12? GMT"
>>          at org.apache.juneau.transforms.LocalizedDatesTest.test(Localiz
>> edDatesTest.java:648)
>>
>> test[341](org.apache.juneau.transforms.LocalizedDatesTest)  Time elapsed:
>> 0.001 sec  <<< ERROR!
>> org.apache.juneau.InvalidDataConversionException: Invalid data conversion
>> from type 'java.lang.String' to type 'java.util.Date'. Value='2001?3?3?'.
>>          at org.apache.juneau.transforms.LocalizedDatesTest.test(Localiz
>> edDatesTest.java:648)
>> Caused by: java.text.ParseException: Unparseable date: "2001?3?3?"
>>          at org.apache.juneau.transforms.LocalizedDatesTest.test(Localiz
>> edDatesTest.java:648)
>>
>> test[342](org.apache.juneau.transforms.LocalizedDatesTest)  Time elapsed:
>> 0.001 sec  <<< ERROR!
>> org.apache.juneau.InvalidDataConversionException: Invalid data conversion
>> from type 'java.lang.String' to type 'java.util.Date'. Value='2001?3?3?'.
>>          at org.apache.juneau.transforms.LocalizedDatesTest.test(Localiz
>> edDatesTest.java:648)
>> Caused by: java.text.ParseException: Unparseable date: "2001?3?3?"
>>          at org.apache.juneau.transforms.LocalizedDatesTest.test(Localiz
>> edDatesTest.java:648)
>>
>> test[343](org.apache.juneau.transforms.LocalizedDatesTest)  Time elapsed:
>> 0 sec  <<< ERROR!
>> org.apache.juneau.InvalidDataConversionException: Invalid data conversion
>> from type 'java.lang.String' to type 'java.util.Date'. Value='2001?3?3?'.
>>          at org.apache.juneau.transforms.LocalizedDatesTest.test(Localiz
>> edDatesTest.java:648)
>> Caused by: java.text.ParseException: Unparseable date: "2001?3?3?"
>>          at org.apache.juneau.transforms.LocalizedDatesTest.test(Localiz
>> edDatesTest.java:648)
>>
>> test[344](org.apache.juneau.transforms.LocalizedDatesTest)  Time elapsed:
>> 0.001 sec  <<< ERROR!
>> org.apache.juneau.InvalidDataConversionException: Invalid data conversion
>> from type 'java.lang.String' to type 'java.util.Date'. Value='2001?3?3?'.
>>          at org.apache.juneau.transforms.LocalizedDatesTest.test(Localiz
>> edDatesTest.java:648)
>> Caused by: java.text.ParseException: Unparseable date: "2001?3?3?"
>>          at org.apache.juneau.transforms.LocalizedDatesTest.test(Localiz
>> edDatesTest.java:648)
>>
>> test[421](org.apache.juneau.transforms.LocalizedDatesTest)  Time elapsed:
>> 0.002 sec  <<< ERROR!
>> org.apache.juneau.InvalidDataConversionException: Invalid data conversion
>> from type 'java.lang.String' to type 'java.util.Date'. Value='2001?3?3?
>> 10?11?12? GMT'.
>>          at org.apache.juneau.transforms.LocalizedDatesTest.test(Localiz
>> edDatesTest.java:648)
>> Caused by: java.text.ParseException: Unparseable date: "2001?3?3?
>> 10?11?12? GMT"
>>          at org.apache.juneau.transforms.LocalizedDatesTest.test(Localiz
>> edDatesTest.java:648)
>>
>> test[422](org.apache.juneau.transforms.LocalizedDatesTest)  Time elapsed:
>> 0 sec  <<< ERROR!
>> org.apache.juneau.InvalidDataConversionException: Invalid data conversion
>> from type 'java.lang.String' to type 'java.util.Date'. Value='2001?3?3?
>> 10?11?12? GMT'.
>>          at org.apache.juneau.transforms.LocalizedDatesTest.test(Localiz
>> edDatesTest.java:648)
>> Caused by: java.text.ParseException: Unparseable date: "2001?3?3?
>> 10?11?12? GMT"
>>          at org.apache.juneau.transforms.LocalizedDatesTest.test(Localiz
>> edDatesTest.java:648)
>>
>> test[423](org.apache.juneau.transforms.LocalizedDatesTest)  Time elapsed:
>> 0.001 sec  <<< ERROR!
>> org.apache.juneau.InvalidDataConversionException: Invalid data conversion
>> from type 'java.lang.String' to type 'java.util.Date'. Value='2001?3?3?
>> 10?11?12? GMT'.
>>          at org.apache.juneau.transforms.LocalizedDatesTest.test(Localiz
>> edDatesTest.java:648)
>> Caused by: java.text.ParseException: Unparseable date: "2001?3?3?
>> 10?11?12? GMT"
>>          at org.apache.juneau.transforms.LocalizedDatesTest.test(Localiz
>> edDatesTest.java:648)
>>
>> test[424](org.apache.juneau.transforms.LocalizedDatesTest)  Time elapsed:
>> 0 sec  <<< ERROR!
>> org.apache.juneau.InvalidDataConversionException: Invalid data conversion
>> from type 'java.lang.String' to type 'java.util.Date'. Value='2001?3?3?
>> 10?11?12? GMT'.
>>          at org.apache.juneau.transforms.LocalizedDatesTest.test(Localiz
>> edDatesTest.java:648)
>> Caused by: java.text.ParseException: Unparseable date: "2001?3?3?
>> 10?11?12? GMT"
>>          at org.apache.juneau.transforms.LocalizedDatesTest.test(Localiz
>> edDatesTest.java:648)
>>
>> Running org.apache.juneau.transforms.PojoSwapTest
>> Tests run: 1, Failures: 0, Errors: 0, Skipped: 0, Time elapsed: 0.002 sec
>> - in org.apache.juneau.transforms.PojoSwapTest
>> Running org.apache.juneau.transforms.ReaderFilterTest
>> Tests run: 1, Failures: 0, Errors: 0, Skipped: 0, Time elapsed: 0.003 sec
>> - in org.apache.juneau.transforms.ReaderFilterTest
>> Running org.apache.juneau.transforms.ReaderObjectSwapTest
>> Tests run: 231, Failures: 0, Errors: 0, Skipped: 0, Time elapsed: 0.003
>> sec - in org.apache.juneau.transforms.ReaderObjectSwapTest
>> Running org.apache.juneau.transforms.SwapsAnnotationComboTest
>> Tests run: 336, Failures: 0, Errors: 0, Skipped: 0, Time elapsed: 0.121
>> sec - in org.apache.juneau.transforms.SwapsAnnotationComboTest
>> Running org.apache.juneau.urlencoding.CommonParser_UonTest
>> Tests run: 4, Failures: 0, Errors: 0, Skipped: 0, Time elapsed: 0.009 sec
>> - in org.apache.juneau.urlencoding.CommonParser_UonTest
>> Running org.apache.juneau.urlencoding.CommonParser_UrlEncodingTest
>> Tests run: 5, Failures: 0, Errors: 0, Skipped: 0, Time elapsed: 0.021 sec
>> - in org.apache.juneau.urlencoding.CommonParser_UrlEncodingTest
>> Running org.apache.juneau.urlencoding.Common_UonTest
>> Tests run: 8, Failures: 0, Errors: 0, Skipped: 0, Time elapsed: 0.081 sec
>> - in org.apache.juneau.urlencoding.Common_UonTest
>> Running org.apache.juneau.urlencoding.Common_UrlEncodingTest
>> Tests run: 8, Failures: 0, Errors: 0, Skipped: 0, Time elapsed: 0.015 sec
>> - in org.apache.juneau.urlencoding.Common_UrlEncodingTest
>> Running org.apache.juneau.urlencoding.UonParserReaderTest
>> Tests run: 1, Failures: 0, Errors: 0, Skipped: 0, Time elapsed: 0.003 sec
>> - in org.apache.juneau.urlencoding.UonParserReaderTest
>> Running org.apache.juneau.urlencoding.UonParserTest
>> Tests run: 3, Failures: 0, Errors: 0, Skipped: 0, Time elapsed: 0.003 sec
>> - in org.apache.juneau.urlencoding.UonParserTest
>> Running org.apache.juneau.urlencoding.UonSerializerTest
>> Tests run: 2, Failures: 0, Errors: 0, Skipped: 0, Time elapsed: 0.001 sec
>> - in org.apache.juneau.urlencoding.UonSerializerTest
>> Running org.apache.juneau.urlencoding.UrlEncodingParserTest
>> Tests run: 12, Failures: 0, Errors: 0, Skipped: 0, Time elapsed: 0.016 sec
>> - in org.apache.juneau.urlencoding.UrlEncodingParserTest
>> Running org.apache.juneau.urlencoding.UrlEncodingSerializerTest
>> Tests run: 7, Failures: 0, Errors: 0, Skipped: 0, Time elapsed: 0.001 sec
>> - in org.apache.juneau.urlencoding.UrlEncodingSerializerTest
>> Running org.apache.juneau.utils.ArgsTest
>> Tests run: 1, Failures: 0, Errors: 0, Skipped: 0, Time elapsed: 0.003 sec
>> - in org.apache.juneau.utils.ArgsTest
>> Running org.apache.juneau.utils.ArrayUtilsTest
>> Tests run: 7, Failures: 0, Errors: 0, Skipped: 0, Time elapsed: 0.001 sec
>> - in org.apache.juneau.utils.ArrayUtilsTest
>> Running org.apache.juneau.utils.ByteArrayCacheTest
>> Tests run: 1, Failures: 0, Errors: 0, Skipped: 0, Time elapsed: 0.002 sec
>> - in org.apache.juneau.utils.ByteArrayCacheTest
>> Running org.apache.juneau.utils.ByteArrayInOutStreamTest
>> Tests run: 1, Failures: 0, Errors: 0, Skipped: 0, Time elapsed: 0.002 sec
>> - in org.apache.juneau.utils.ByteArrayInOutStreamTest
>> Running org.apache.juneau.utils.CharSetTest
>> Tests run: 1, Failures: 0, Errors: 0, Skipped: 0, Time elapsed: 0.003 sec
>> - in org.apache.juneau.utils.CharSetTest
>> Running org.apache.juneau.utils.ClassUtilsTest
>> Tests run: 8, Failures: 0, Errors: 0, Skipped: 0, Time elapsed: 0.003 sec
>> - in org.apache.juneau.utils.ClassUtilsTest
>> Running org.apache.juneau.utils.CollectionUtilsTest
>> Tests run: 1, Failures: 0, Errors: 0, Skipped: 0, Time elapsed: 0.002 sec
>> - in org.apache.juneau.utils.CollectionUtilsTest
>> Running org.apache.juneau.utils.FilteredMapTest
>> Tests run: 1, Failures: 0, Errors: 0, Skipped: 0, Time elapsed: 0.004 sec
>> - in org.apache.juneau.utils.FilteredMapTest
>> Running org.apache.juneau.utils.IdentityListTest
>> Tests run: 1, Failures: 0, Errors: 0, Skipped: 0, Time elapsed: 0.005 sec
>> - in org.apache.juneau.utils.IdentityListTest
>> Running org.apache.juneau.utils.IOPipeTest
>> Tests run: 5, Failures: 0, Errors: 0, Skipped: 0, Time elapsed: 0.003 sec
>> - in org.apache.juneau.utils.IOPipeTest
>> Running org.apache.juneau.utils.IOUtilsTest
>> Tests run: 1, Failures: 0, Errors: 0, Skipped: 0, Time elapsed: 0.002 sec
>> - in org.apache.juneau.utils.IOUtilsTest
>> Running org.apache.juneau.utils.KeywordStoreTest
>> Tests run: 1, Failures: 0, Errors: 0, Skipped: 0, Time elapsed: 0.002 sec
>> - in org.apache.juneau.utils.KeywordStoreTest
>> Running org.apache.juneau.utils.MultiIterableTest
>> Tests run: 1, Failures: 0, Errors: 0, Skipped: 0, Time elapsed: 0.003 sec
>> - in org.apache.juneau.utils.MultiIterableTest
>> Running org.apache.juneau.utils.MultiSetTest
>> Tests run: 1, Failures: 0, Errors: 0, Skipped: 0, Time elapsed: 0.003 sec
>> - in org.apache.juneau.utils.MultiSetTest
>> Running org.apache.juneau.utils.ParserReaderTest
>> Tests run: 1, Failures: 0, Errors: 0, Skipped: 0, Time elapsed: 0.002 sec
>> - in org.apache.juneau.utils.ParserReaderTest
>> Running org.apache.juneau.utils.PojoIntrospectorTest
>> Tests run: 1, Failures: 0, Errors: 0, Skipped: 0, Time elapsed: 0.003 sec
>> - in org.apache.juneau.utils.PojoIntrospectorTest
>> Running org.apache.juneau.utils.PojoMergeTest
>> Tests run: 1, Failures: 0, Errors: 0, Skipped: 0, Time elapsed: 0.002 sec
>> - in org.apache.juneau.utils.PojoMergeTest
>> Running org.apache.juneau.utils.PojoQueryTest
>> Tests run: 5, Failures: 0, Errors: 0, Skipped: 0, Time elapsed: 0.015 sec
>> - in org.apache.juneau.utils.PojoQueryTest
>> Running org.apache.juneau.utils.PojoRestTest
>> Tests run: 10, Failures: 0, Errors: 0, Skipped: 0, Time elapsed: 0.768 sec
>> - in org.apache.juneau.utils.PojoRestTest
>> Running org.apache.juneau.utils.SimpleMapTest
>> Tests run: 1, Failures: 0, Errors: 0, Skipped: 0, Time elapsed: 0.002 sec
>> - in org.apache.juneau.utils.SimpleMapTest
>> Running org.apache.juneau.utils.StringBuilderWriterTest
>> Tests run: 1, Failures: 0, Errors: 0, Skipped: 0, Time elapsed: 0.002 sec
>> - in org.apache.juneau.utils.StringBuilderWriterTest
>> Running org.apache.juneau.utils.StringUtilsTest
>> Tests run: 22, Failures: 0, Errors: 0, Skipped: 0, Time elapsed: 0.018 sec
>> - in org.apache.juneau.utils.StringUtilsTest
>> Running org.apache.juneau.utils.StringVarResolverTest
>> Tests run: 7, Failures: 0, Errors: 0, Skipped: 0, Time elapsed: 0.007 sec
>> - in org.apache.juneau.utils.StringVarResolverTest
>> Running org.apache.juneau.utils.UriContextResolutionComboTest
>> Tests run: 720, Failures: 0, Errors: 0, Skipped: 0, Time elapsed: 0.051
>> sec - in org.apache.juneau.utils.UriContextResolutionComboTest
>> Running org.apache.juneau.utils.UriContextUriComboTest
>> Tests run: 70, Failures: 0, Errors: 0, Skipped: 0, Time elapsed: 0.003 sec
>> - in org.apache.juneau.utils.UriContextUriComboTest
>> Running org.apache.juneau.VisibilityTest
>> Tests run: 1, Failures: 0, Errors: 0, Skipped: 0, Time elapsed: 0.009 sec
>> - in org.apache.juneau.VisibilityTest
>> Running org.apache.juneau.xml.BasicXmlTest
>> Tests run: 384, Failures: 0, Errors: 0, Skipped: 0, Time elapsed: 0.498
>> sec - in org.apache.juneau.xml.BasicXmlTest
>> Running org.apache.juneau.xml.CommonParserTest
>> Tests run: 4, Failures: 0, Errors: 0, Skipped: 0, Time elapsed: 0.01 sec -
>> in org.apache.juneau.xml.CommonParserTest
>> Running org.apache.juneau.xml.CommonTest
>> Tests run: 8, Failures: 0, Errors: 0, Skipped: 0, Time elapsed: 0.025 sec
>> - in org.apache.juneau.xml.CommonTest
>> Running org.apache.juneau.xml.CommonXmlTest
>> Tests run: 2, Failures: 0, Errors: 0, Skipped: 0, Time elapsed: 0.004 sec
>> - in org.apache.juneau.xml.CommonXmlTest
>> Running org.apache.juneau.xml.InvalidXmlBeansTest
>> Tests run: 15, Failures: 0, Errors: 0, Skipped: 0, Time elapsed: 0.01 sec
>> - in org.apache.juneau.xml.InvalidXmlBeansTest
>> Running org.apache.juneau.xml.XmlCollapsedTest
>> Tests run: 9, Failures: 0, Errors: 0, Skipped: 0, Time elapsed: 0.054 sec
>> - in org.apache.juneau.xml.XmlCollapsedTest
>> Running org.apache.juneau.xml.XmlContentTest
>> Tests run: 2, Failures: 0, Errors: 0, Skipped: 0, Time elapsed: 0.009 sec
>> - in org.apache.juneau.xml.XmlContentTest
>> Running org.apache.juneau.xml.XmlParserTest
>> Tests run: 3, Failures: 0, Errors: 0, Skipped: 0, Time elapsed: 0.004 sec
>> - in org.apache.juneau.xml.XmlParserTest
>> Running org.apache.juneau.xml.XmlTest
>> Tests run: 27, Failures: 0, Errors: 0, Skipped: 0, Time elapsed: 0.238 sec
>> - in org.apache.juneau.xml.XmlTest
>> Running org.apache.juneau.yaml.proto.CommonParserTest
>> Tests run: 4, Failures: 0, Errors: 0, Skipped: 0, Time elapsed: 0.016 sec
>> - in org.apache.juneau.yaml.proto.CommonParserTest
>> Running org.apache.juneau.yaml.proto.CommonTest
>> Tests run: 1, Failures: 0, Errors: 0, Skipped: 1, Time elapsed: 0.002 sec
>> - in org.apache.juneau.yaml.proto.CommonTest
>> Running org.apache.juneau.yaml.proto.YamlParserTest
>> Tests run: 1, Failures: 0, Errors: 0, Skipped: 1, Time elapsed: 0.004 sec
>> - in org.apache.juneau.yaml.proto.YamlParserTest
>> Running org.apache.juneau.yaml.proto.YamlTest
>> Tests run: 1, Failures: 0, Errors: 0, Skipped: 0, Time elapsed: 0.002 sec
>> - in org.apache.juneau.yaml.proto.YamlTest
>>
>>
>> D:\ASF\juneau\release_candidates\juneau-7.0.0>java -version
>> java version "1.8.0"
>> Java(TM) SE Runtime Environment (build pwa6480sr3fp21-20161117_02(SR3
>> FP21))
>> IBM J9 VM (build 2.8, JRE 1.8.0 Windows Server 2008 R2 amd64-64 Compressed
>> References 20161114_325917 (JIT enabled, AOT enabled)
>> J9VM - R28_20161114_0146_B325917
>> JIT  - tr.r14.java.green_20161111_127476
>> GC   - R28_20161114_0146_B325917_CMPRSS
>> J9CL - 20161114_325917)
>> JCL - 20161116_01 based on Oracle jdk8u111-b14
>>
>>
>>
>>
>> On 23/10/2017 17:21, James Bognar wrote:
>>
>>> Hi David,
>>>
>>> These issues (along with some others) were supposed to be fixed yesterday
>>> before I created the release.  Are you importing the release candidate or
>>> from the git repo?
>>>
>>> Thanks!
>>>
>>> On Mon, Oct 23, 2017 at 10:45 AM, David Goddard <goddard@acm.org> wrote:
>>>
>>> Hi,
>>>>
>>>> Some minor build issues for me.
>>>>
>>>> The src/main/resources directory is missing from juneau-doc, causing a
>>>> build error in Eclipse.  Two solutions: add src/main/resources into the
>>>> repo, or remove it from juneau-doc/.classpath:
>>>>
>>>> @@ -7,11 +7,6 @@
>>>>                           <attribute name="maven.pomderived"
>>>> value="true"/>
>>>>                   </attributes>
>>>>           </classpathentry>
>>>>           <classpathentry excluding="**" kind="src"
>>>> output="target/classes"
>>>> path="src/main/resources">
>>>>                   <attributes>
>>>>                           <attribute name="maven.pomderived"
>>>> value="true"/>
>>>>                   </attributes>
>>>>           </classpathentry>
>>>>           <classpathentry kind="con" path="org.eclipse.jdt.launchin
>>>> g.JRE_CONTAINER/org.eclipse.jdt.internal.debug.ui.launcher
>>>> .StandardVMType/JavaSE-1.7">
>>>>                   <attributes>
>>>>                           <attribute name="maven.pomderived"
>>>> value="true"/>
>>>>
>>>> Not sure which is most appropriate - probably removing it from the
>>>> classpath I guess.
>>>>
>>>>
>>>> I'm also seeing a dependency issue in juneau-microservice/juneau-mic
>>>> roservice-template/build-overlay/pom.xml:
>>>>
>>>> <dependencies>
>>>>           <dependency>
>>>>                   <groupId>org.apache.juneau</groupId>
>>>>                   <artifactId>juneau-microservice-server</artifactId>
>>>>                   <version>${version}</version>
>>>>           </dependency>
>>>> </dependencies>
>>>>
>>>> I think that should be ${juneau.version} rather than ${version}?
>>>>
>>>> David
>>>>
>>>>
>>>>
>>>> On 22/10/2017 22:39, James Bognar wrote:
>>>>
>>>> I am pleased to be calling this vote for the source release of Apache
>>>>> Juneau 7.0.0 RC1.
>>>>>
>>>>> This will be our first official release as an Apache Top Level Project.
>>>>> There are only minor code changes from 6.4.0-incubating.
>>>>>
>>>>> The binaries are available at:
>>>>> https://dist.apache.org/repos/dist/dev/juneau/binaries/junea
>>>>> u-7.0.0-RC1/
>>>>>
>>>>> The release candidate to be voted over is available at:
>>>>> https://dist.apache.org/repos/dist/dev/juneau/source/juneau-7.0.0-RC1/
>>>>>
>>>>> SHA-1 checksums:
>>>>> 50eb946e613a15a50fea00ba6d6b712f46d34613 apache-juneau-7.0.0-src.zip
>>>>> b2b3a1c2619ce3df67797e92e254b083591ab5d6 apache-juneau-7.0.0-bin.zip
>>>>>
>>>>> MD5 checksums:
>>>>> c8982e13f3e0d29a41b503fce0fca5e2 apache-juneau-7.0.0-src.zip
>>>>> b721c5e79636ff6b07891eceb4213e98 apache-juneau-7.0.0-bin.zip
>>>>>
>>>>> Build the release candidate using:
>>>>> mvn clean install
>>>>>
>>>>> The release candidate is signed with a GPG key available at:
>>>>> https://dist.apache.org/repos/dist/release/juneau/KEYS
>>>>>
>>>>> A staged Maven repository is available for review at:
>>>>> https://repository.apache.org/content/repositories/orgapache
>>>>> juneau-1018/
>>>>>
>>>>> The Git commit for this release is...
>>>>> https://git-wip-us.apache.org/repos/asf?p=juneau.git;a=commi
>>>>> t;h=8b4740edccd65e7f5e09b3d01498fb89b0c8d479
>>>>>
>>>>> Please vote on releasing this package as:
>>>>> Apache Juneau 7.0.0
>>>>>
>>>>> This vote will be open until at least 25-Oct-2017 5:00pm and passes if
a
>>>>> majority of at least three +1 Apache Juneau PMC votes are cast.
>>>>>
>>>>> [ ] +1 Release this package
>>>>> [ ] 0 I don't feel strongly about it, but don't object
>>>>> [ ] -1 Do not release this package because...
>>>>>
>>>>> Anyone can participate in testing and voting, not just committers, so
>>>>> please feel free to try out the release candidate and provide your
>>>>> votes.
>>>>>
>>>>>
>>>>>
>>>>
>>>
>>
> 


Mime
View raw message