juneau-dev mailing list archives

Site index · List index
Message view « Date » · « Thread »
Top « Date » · « Thread »
From James Bognar <jamesbog...@apache.org>
Subject Re: [VOTE] Release Apache Juneau 6.4.0-incubating RC1
Date Wed, 13 Sep 2017 21:41:51 GMT
Hrm....broken pipe and NoHttpResponseExceptions.  Perhaps intermittent
network connection issues?

Could you try the build a couple more times and see if the results are
consistent?

On Wed, Sep 13, 2017 at 5:30 PM, Charles Mims <charles@mims.io> wrote:

> I had failures in "Microservice Tests" when trying to build juneau
> from this link:
>
> https://dist.apache.org/repos/dist/dev/incubator/juneau/
> source/juneau-6.4.0-incubating-RC1/apache-juneau-6.4.0-incubating-src.zip
> ...
> mvn -fae clean install
> ...
> [INFO] ------------------------------------------------------------
> ------------
> [INFO] Reactor Summary:
> [INFO]
> [INFO] Apache Juneau (incubating) ......................... SUCCESS [
> 2.401 s]
> [INFO] Apache Juneau - Core APIs .......................... SUCCESS [
> 0.196 s]
> [INFO] Apache Juneau Marshall ............................. SUCCESS [
> 13.216 s]
> [INFO] Apache Juneau Marshal RDF .......................... SUCCESS [
> 1.605 s]
> [INFO] Apache Juneau Data Transfer Objects ................ SUCCESS [
> 2.589 s]
> [INFO] Apache Juneau Core ................................. SUCCESS [
> 0.537 s]
> [INFO] Apache Juneau Config File API ...................... SUCCESS [
> 0.786 s]
> [INFO] Apache Juneau Core Tests ........................... SUCCESS [
> 31.120 s]
> [INFO] Apache Juneau - REST APIs .......................... SUCCESS [
> 0.084 s]
> [INFO] Apache Juneau REST Servlet API ..................... SUCCESS [
> 2.239 s]
> [INFO] Apache Juneau REST JAX/RS API ...................... SUCCESS [
> 0.449 s]
> [INFO] Apache Juneau REST Client API ...................... SUCCESS [
> 1.032 s]
> [INFO] Apache Juneau - Microservice APIs .................. SUCCESS [
> 0.106 s]
> [INFO] Apache Juneau Microservice Server .................. SUCCESS [
> 1.301 s]
> [INFO] Apache Juneau Microservice Template ................ SUCCESS [
> 1.312 s]
> [INFO] Apache Juneau - Examples ........................... SUCCESS [
> 0.116 s]
> [INFO] Apache Juneau REST Examples ........................ SUCCESS [
> 7.460 s]
> [INFO] Apache Juneau Microservice Tests ................... FAILURE [
> 18.211 s]
> [INFO] Apache Juneau Core Examples ........................ SUCCESS [
> 0.261 s]
> [INFO] Apache Juneau - Release Engineering ................ SUCCESS [
> 0.029 s]
> [INFO] Apache Juneau UberJar .............................. SUCCESS [
> 1.181 s]
> [INFO] Apache Juneau Distribution ......................... SUCCESS [
> 1.588 s]
> [INFO] ------------------------------------------------------------
> ------------
> [INFO] BUILD FAILURE
> [INFO] ------------------------------------------------------------
> ------------
> [INFO] Total time: 01:28 min
> [INFO] Finished at: 2017-09-13T14:48:01-05:00
> [INFO] Final Memory: 88M/794M
> [INFO] ------------------------------------------------------------
> ------------
> [ERROR] Failed to execute goal
> org.apache.maven.plugins:maven-surefire-plugin:2.19.1:test
> (default-test) on project juneau-microservice-test: There are test
> failures.
>
> $ cat /Users/cmims/juneau-6.4.0-incubating/juneau-microservice/juneau-
> microservice-test/target/surefire-reports/org.apache.
> juneau.rest.test._TestSuite.txt
> ------------------------------------------------------------
> -------------------
> Test set: org.apache.juneau.rest.test._TestSuite
> ------------------------------------------------------------
> -------------------
> Tests run: 2868, Failures: 0, Errors: 2, Skipped: 1, Time elapsed:
> 15.925 sec <<< FAILURE! - in org.apache.juneau.rest.test._TestSuite
> m04_setMultiParamsFloatObject[1](org.apache.juneau.rest.
> test.InterfaceProxyTest)
>  Time elapsed: 0.009 sec  <<< ERROR!
> java.lang.RuntimeException:
> org.apache.juneau.rest.client.RestCallException: Broken pipe (Write
> failed)
> at org.apache.juneau.rest.test.InterfaceProxyTest.m04_
> setMultiParamsFloatObject(InterfaceProxyTest.java:765)
> Caused by: org.apache.juneau.rest.client.RestCallException: Broken
> pipe (Write failed)
> at org.apache.juneau.rest.test.InterfaceProxyTest.m04_
> setMultiParamsFloatObject(InterfaceProxyTest.java:765)
> Caused by: org.apache.juneau.BeanRuntimeException: Broken pipe (Write
> failed)
> at org.apache.juneau.rest.test.InterfaceProxyTest.m04_
> setMultiParamsFloatObject(InterfaceProxyTest.java:765)
> Caused by: java.net.SocketException: Broken pipe (Write failed)
> at org.apache.juneau.rest.test.InterfaceProxyTest.m04_
> setMultiParamsFloatObject(InterfaceProxyTest.java:765)
>
> ef04_setEnum3dList[1](org.apache.juneau.rest.test.ThirdPartyProxyTest)
>  Time elapsed: 0.002 sec  <<< ERROR!
> java.lang.RuntimeException:
> org.apache.juneau.rest.client.RestCallException: Broken pipe (Write
> failed)
> at org.apache.juneau.rest.test.ThirdPartyProxyTest.ef04_setEnum3dList(
> ThirdPartyProxyTest.java:1229)
> Caused by: org.apache.juneau.rest.client.RestCallException: Broken
> pipe (Write failed)
> at org.apache.juneau.rest.test.ThirdPartyProxyTest.ef04_setEnum3dList(
> ThirdPartyProxyTest.java:1229)
> Caused by: org.apache.juneau.BeanRuntimeException: Broken pipe (Write
> failed)
> at org.apache.juneau.rest.test.ThirdPartyProxyTest.ef04_setEnum3dList(
> ThirdPartyProxyTest.java:1229)
> Caused by: java.net.SocketException: Broken pipe (Write failed)
> at org.apache.juneau.rest.test.ThirdPartyProxyTest.ef04_setEnum3dList(
> ThirdPartyProxyTest.java:1229)
>
>
>
> Oddly, when I try to build what I think is the corresponding commit
> from the git repo, I get different tests failing.
>
>
>
> [15:52:34] cmims@MBP:~$ git clone git@github.com:apache/
> incubator-juneau.git
> Cloning into 'incubator-juneau'...
> ...
> [15:53:08] cmims@MBP:~$ cd incubator-juneau
> [15:53:08] cmims@MBP:~/incubator-juneau$ git fetch
> [15:53:09] cmims@MBP:~/incubator-juneau$ git checkout
> juneau-6.4.0-incubating-RC1
> Note: checking out 'juneau-6.4.0-incubating-RC1'.
> ...
> HEAD is now at 231c3b22... [maven-release-plugin] prepare release
> juneau-6.4.0-incubating-RC1
>
> $ mvn -fae clean install
> ...
> [INFO] ------------------------------------------------------------
> ------------
> [INFO] Reactor Summary:
> [INFO]
> [INFO] Apache Juneau (incubating) ......................... SUCCESS [
> 2.209 s]
> [INFO] Apache Juneau - Core APIs .......................... SUCCESS [
> 0.126 s]
> [INFO] Apache Juneau Marshall ............................. SUCCESS [
> 14.841 s]
> [INFO] Apache Juneau Marshal RDF .......................... SUCCESS [
> 1.356 s]
> [INFO] Apache Juneau Data Transfer Objects ................ SUCCESS [
> 2.676 s]
> [INFO] Apache Juneau Core ................................. SUCCESS [
> 0.560 s]
> [INFO] Apache Juneau Config File API ...................... SUCCESS [
> 0.705 s]
> [INFO] Apache Juneau Core Tests ........................... SUCCESS [
> 32.473 s]
> [INFO] Apache Juneau - REST APIs .......................... SUCCESS [
> 0.070 s]
> [INFO] Apache Juneau REST Servlet API ..................... SUCCESS [
> 1.917 s]
> [INFO] Apache Juneau REST JAX/RS API ...................... SUCCESS [
> 0.467 s]
> [INFO] Apache Juneau REST Client API ...................... SUCCESS [
> 0.981 s]
> [INFO] Apache Juneau - Microservice APIs .................. SUCCESS [
> 0.054 s]
> [INFO] Apache Juneau Microservice Server .................. SUCCESS [
> 1.474 s]
> [INFO] Apache Juneau Microservice Template ................ SUCCESS [
> 1.147 s]
> [INFO] Apache Juneau - Examples ........................... SUCCESS [
> 0.047 s]
> [INFO] Apache Juneau REST Examples ........................ SUCCESS [
> 7.180 s]
> [INFO] Apache Juneau Microservice Tests ................... FAILURE [
> 19.892 s]
> [INFO] Apache Juneau Core Examples ........................ SUCCESS [
> 0.772 s]
> [INFO] Apache Juneau - Release Engineering ................ SUCCESS [
> 0.168 s]
> [INFO] Apache Juneau UberJar .............................. SUCCESS [
> 2.801 s]
> [INFO] Apache Juneau Distribution ......................... SUCCESS [
> 2.879 s]
> [INFO] ------------------------------------------------------------
> ------------
> [INFO] BUILD FAILURE
> [INFO] ------------------------------------------------------------
> ------------
> [INFO] Total time: 01:35 min
> [INFO] Finished at: 2017-09-13T15:55:33-05:00
> [INFO] Final Memory: 89M/814M
> [INFO] ------------------------------------------------------------
> ------------
> [ERROR] Failed to execute goal
> org.apache.maven.plugins:maven-surefire-plugin:2.19.1:test
> (default-test) on project juneau-microservice-test: There are test
> failures.
>
>
> [15:55:34] cmims@MBP:~/incubator-juneau$ cat
> /Users/cmims/incubator-juneau/juneau-microservice/juneau-
> microservice-test/target/surefire-reports/
> TEST-org.apache.juneau.rest.test._TestSuite.xml
> org.apache.juneau.rest.test._TestSuite.txt
> [15:55:34] cmims@MBP:~/incubator-juneau$ cat
> /Users/cmims/incubator-juneau/juneau-microservice/juneau-
> microservice-test/target/surefire-reports/org.apache.
> juneau.rest.test._TestSuite.txt
> ------------------------------------------------------------
> -------------------
> Test set: org.apache.juneau.rest.test._TestSuite
> ------------------------------------------------------------
> -------------------
> Tests run: 2868, Failures: 0, Errors: 1, Skipped: 1, Time elapsed:
> 17.637 sec <<< FAILURE! - in org.apache.juneau.rest.test._TestSuite
> testUsingContentParam(org.apache.juneau.rest.test.ContentTest)  Time
> elapsed: 0.057 sec  <<< ERROR!
> org.apache.juneau.rest.client.RestCallException: MBP:10001 failed to
> respond
> at org.apache.juneau.rest.test.ContentTest.testUsingContentParam(
> ContentTest.java:77)
> Caused by: org.apache.http.NoHttpResponseException: MBP:10001 failed to
> respond
> at org.apache.juneau.rest.test.ContentTest.testUsingContentParam(
> ContentTest.java:77)
>
>
>
> On Wed, Sep 13, 2017 at 12:41 PM, 이동욱/Dong-Uk Lee <yidonguk@gmail.com>
> wrote:
> > +1
> >
> > I think it's not a big problem.
> > Thanks James!
> >
> >
> > 2017. 9. 13. 오후 10:39에 "James Bognar" <jamesbognar@apache.org>님이
작성:
> >
> > Thanks Raphi!
> >
> > I validated your change locally.  No problems.
> >
> > What is your vote otherwise?  Do you think this requires another release
> > candidate?
> >
> > On Wed, Sep 13, 2017 at 12:23 AM, Raphi D Lee <yidonguk@gmail.com>
> wrote:
> >
> >>
> >> Hi all,
> >>
> >> I’ve tried to build this release and faced Test Fail like below
> >>
> >> Failed tests:
> >>   DataConversionTest.testObjectSwaps:153 expected:<Jan 1[2], 2001> but
> >> was:<Jan 1[1], 2001>
> >>   CalendarSwapTest.testBeanProperyFilterHtml:198
> >> expected:<-2172115000000> but was:<-2172116928000>
> >>   CalendarSwapTest.testBeanProperyFilterJson:162
> >> expected:<-2172115000000> but was:<-2172116928000>
> >>   CalendarSwapTest.testBeanProperyFilterUon:217
> expected:<-2172115000000>
> >> but was:<-2172116928000>
> >>   CalendarSwapTest.testBeanProperyFilterUrlEncoding:240
> >> expected:<-2172115000000> but was:<-2172116928000>
> >>   CalendarSwapTest.testBeanProperyFilterXml:180
> expected:<-2172115000000>
> >> but was:<-2172116928000>
> >>
> >>
> >> So, I made some code changes and committed.
> >> Please take a look my changes.
> >>
> >>
> >> Thanks
> >>
> >>
> >>
> >>
> >> Raphi D Lee, yidonguk@gmail.com
> >>
> >>
> >>
> >>
> >> 2017. 9. 13. 오전 12:21, Steve Blackmon <sblackmon@apache.org> 작성:
> >>
> >> +1 (binding)
> >>
> >> - confirmed SUCCESS from mvn clean install
> >> - checked md5 and shasum for bin and src release artifacts
> >> - verified gpg signatures
> >>
> >> Steve
> >>
> >> On Sep 10, 2017 at 6:27 PM, James Bognar <jamesbognar@apache.org>
> wrote:
> >>
> >>
> >> I am pleased to be calling this vote for the source release of Apache
> >> Juneau 6.4.0-incubating RC1.
> >>
> >> The list of new features can be found here:
> >> http://juneau.incubator.apache.org/site/apidocs/overview-
> >> summary.html#6.4.0
> >>
> >> The binaries are available at:
> >> https://dist.apache.org/repos/dist/dev/incubator/juneau/bina
> >> ries/juneau-6.4.0-incubating-RC1/
> >>
> >> The release candidate to be voted over is available at:
> >> https://dist.apache.org/repos/dist/dev/incubator/juneau/sour
> >> ce/juneau-6.4.0-incubating-RC1/
> >>
> >> SHA-1 checksums:
> >> 0d04cf1808e0d46e1f2025d085b5fa104be99e38
> >> apache-juneau-6.4.0-incubating-src.zip
> >> b456a34aa6b7c36abf7208b391734f16c0634ca5
> >> apache-juneau-6.4.0-incubating-bin.zip
> >>
> >> MD5 checksums:
> >> cca93858b1653150c2ab06d170dcf60f apache-juneau-6.4.0-incubating-src.zip
> >> 23183baf4364c987dabb7ad112a04db0 apache-juneau-6.4.0-incubating-bin.zip
> >>
> >> Build the release candidate using:
> >> mvn clean install
> >>
> >> The release candidate is signed with a GPG key available at:
> >> https://dist.apache.org/repos/dist/release/incubator/juneau/KEYS
> >>
> >> A staged Maven repository is available for review at:
> >> https://repository.apache.org/content/repositories/
> orgapachejuneau-1015/
> >>
> >> The Git commit for this release is...
> >> https://git-wip-us.apache.org/repos/asf?p=incubator-juneau.g
> >> it;a=commit;h=231c3b226762e08de1250be681e2b5be680d7ff8
> >>
> >> Please vote on releasing this package as:
> >> Apache Juneau 6.4.0-incubating
> >>
> >> This vote will be open until 13-Sep-2017 7:30pm EST and passes if a
> >> majority of at least three +1 Apache Juneau PPMC votes are cast.
> >>
> >> [ ] +1 Release this package
> >> [ ] 0 I don't feel strongly about it, but don't object
> >> [ ] -1 Do not release this package because...
> >>
> >> Anyone can participate in testing and voting, not just committers,
> please
> >> feel free to try out the release candidate and provide your votes.
> >>
> >>
> >>
>
>
>
> --
> Charles Mims
> pgp key: 81C62E56F930E099
>

Mime
  • Unnamed multipart/alternative (inline, None, 0 bytes)
View raw message