juneau-dev mailing list archives

Site index · List index
Message view « Date » · « Thread »
Top « Date » · « Thread »
From Apache Jenkins Server <jenk...@builds.apache.org>
Subject Build failed in Jenkins: Juneau-Java-1.7 #303
Date Mon, 22 May 2017 00:28:14 GMT
See <https://builds.apache.org/job/Juneau-Java-1.7/303/display/redirect?page=changes>

Changes:

[phaumer] Maven requires a main/java folder.

------------------------------------------
[...truncated 99.77 KB...]
Running org.apache.juneau.internal.VersionRangeTest
Tests run: 22, Failures: 0, Errors: 0, Skipped: 0, Time elapsed: 0.006 sec - in org.apache.juneau.internal.VersionRangeTest
Running org.apache.juneau.dto.jsonschema.JsonSchemaTest
Tests run: 2, Failures: 0, Errors: 0, Skipped: 0, Time elapsed: 0.039 sec - in org.apache.juneau.dto.jsonschema.JsonSchemaTest
Running org.apache.juneau.dto.html5.Html5TemplateComboTest
Tests run: 65, Failures: 0, Errors: 0, Skipped: 0, Time elapsed: 0.683 sec - in org.apache.juneau.dto.html5.Html5TemplateComboTest
Running org.apache.juneau.dto.html5.Html5ComboTest
Tests run: 4550, Failures: 0, Errors: 0, Skipped: 0, Time elapsed: 6.185 sec - in org.apache.juneau.dto.html5.Html5ComboTest
Running org.apache.juneau.dto.atom.AtomTest
Tests run: 3, Failures: 0, Errors: 0, Skipped: 0, Time elapsed: 0.364 sec - in org.apache.juneau.dto.atom.AtomTest
Running org.apache.juneau.dto.cognos.CognosXmlTest
Tests run: 1, Failures: 0, Errors: 0, Skipped: 0, Time elapsed: 0.008 sec - in org.apache.juneau.dto.cognos.CognosXmlTest
Running org.apache.juneau.PojoSwapTest
Tests run: 1, Failures: 0, Errors: 0, Skipped: 0, Time elapsed: 0.003 sec - in org.apache.juneau.PojoSwapTest
Running org.apache.juneau.ini.ConfigFileInterfaceTest
Tests run: 47, Failures: 0, Errors: 0, Skipped: 0, Time elapsed: 0.093 sec - in org.apache.juneau.ini.ConfigFileInterfaceTest
Running org.apache.juneau.ini.ConfigFileTest
Tests run: 45, Failures: 0, Errors: 0, Skipped: 0, Time elapsed: 0.082 sec - in org.apache.juneau.ini.ConfigFileTest
Running org.apache.juneau.ini.ConfigFileBuilderTest
---Usage---
java -cp juneau.jar org.apache.juneau.ini.ConfigFile createBatchEnvFile -configFile <configFile>
-envFile <envFile> [-verbose]
java -cp juneau.jar org.apache.juneau.ini.ConfigFile createShellEnvFile -configFile <configFile>
-envFile <envFile> [-verbose]
java -cp juneau.jar org.apache.juneau.ini.ConfigFile setVals -configFile <configFile>
-vals [var1 val1 [var2 val2...]] [-verbose]
Tests run: 5, Failures: 0, Errors: 0, Skipped: 0, Time elapsed: 0.007 sec - in org.apache.juneau.ini.ConfigFileBuilderTest
Running org.apache.juneau.a.rttests.RoundTripReadOnlyBeansTest
Tests run: 22, Failures: 0, Errors: 0, Skipped: 0, Time elapsed: 0.379 sec - in org.apache.juneau.a.rttests.RoundTripReadOnlyBeansTest
Running org.apache.juneau.a.rttests.RoundTripTrimStringsTest
Tests run: 22, Failures: 0, Errors: 0, Skipped: 0, Time elapsed: 0.181 sec - in org.apache.juneau.a.rttests.RoundTripTrimStringsTest
Running org.apache.juneau.a.rttests.RoundTripTransformBeansTest
Tests run: 132, Failures: 0, Errors: 0, Skipped: 0, Time elapsed: 0.537 sec - in org.apache.juneau.a.rttests.RoundTripTransformBeansTest
Running org.apache.juneau.a.rttests.RoundTripDTOsTest
Tests run: 44, Failures: 0, Errors: 0, Skipped: 0, Time elapsed: 0.956 sec - in org.apache.juneau.a.rttests.RoundTripDTOsTest
Running org.apache.juneau.a.rttests.RoundTripLargeObjectsTest
Tests run: 1, Failures: 0, Errors: 0, Skipped: 1, Time elapsed: 0 sec - in org.apache.juneau.a.rttests.RoundTripLargeObjectsTest
Running org.apache.juneau.a.rttests.RoundTripPrimitiveObjectBeansTest
Tests run: 44, Failures: 0, Errors: 0, Skipped: 0, Time elapsed: 0.882 sec - in org.apache.juneau.a.rttests.RoundTripPrimitiveObjectBeansTest
Running org.apache.juneau.a.rttests.RoundTripToObjectMapsTest
Tests run: 22, Failures: 0, Errors: 0, Skipped: 0, Time elapsed: 0.082 sec - in org.apache.juneau.a.rttests.RoundTripToObjectMapsTest
Running org.apache.juneau.a.rttests.RoundTripNumericConstructorsTest
Tests run: 22, Failures: 0, Errors: 0, Skipped: 0, Time elapsed: 0.02 sec - in org.apache.juneau.a.rttests.RoundTripNumericConstructorsTest
Running org.apache.juneau.a.rttests.RoundTripBeanInheritanceTest
Tests run: 44, Failures: 0, Errors: 0, Skipped: 0, Time elapsed: 0.078 sec - in org.apache.juneau.a.rttests.RoundTripBeanInheritanceTest
Running org.apache.juneau.a.rttests.RoundTripAddClassAttrsTest
Tests run: 70, Failures: 0, Errors: 0, Skipped: 0, Time elapsed: 0.266 sec - in org.apache.juneau.a.rttests.RoundTripAddClassAttrsTest
Running org.apache.juneau.a.rttests.RoundTripObjectsAsStringsTest
Tests run: 66, Failures: 0, Errors: 0, Skipped: 0, Time elapsed: 0.106 sec - in org.apache.juneau.a.rttests.RoundTripObjectsAsStringsTest
Running org.apache.juneau.a.rttests.RoundTripBeanMapsTest
Tests run: 484, Failures: 0, Errors: 0, Skipped: 0, Time elapsed: 1.229 sec - in org.apache.juneau.a.rttests.RoundTripBeanMapsTest
Running org.apache.juneau.a.rttests.RoundTripEnumTest
Tests run: 176, Failures: 0, Errors: 0, Skipped: 0, Time elapsed: 0.272 sec - in org.apache.juneau.a.rttests.RoundTripEnumTest
Running org.apache.juneau.a.rttests.RoundTripObjectsWithSpecialMethodsTest
Tests run: 44, Failures: 0, Errors: 0, Skipped: 0, Time elapsed: 0.066 sec - in org.apache.juneau.a.rttests.RoundTripObjectsWithSpecialMethodsTest
Running org.apache.juneau.a.rttests.RoundTripSimpleObjectsTest
Tests run: 1188, Failures: 0, Errors: 0, Skipped: 0, Time elapsed: 1.164 sec - in org.apache.juneau.a.rttests.RoundTripSimpleObjectsTest
Running org.apache.juneau.a.rttests.RoundTripGenericsTest
Tests run: 22, Failures: 0, Errors: 0, Skipped: 0, Time elapsed: 0.005 sec - in org.apache.juneau.a.rttests.RoundTripGenericsTest
Running org.apache.juneau.a.rttests.RoundTripClassesTest
Tests run: 22, Failures: 0, Errors: 0, Skipped: 0, Time elapsed: 0.056 sec - in org.apache.juneau.a.rttests.RoundTripClassesTest
Running org.apache.juneau.a.rttests.RoundTripMapsTest
Tests run: 132, Failures: 0, Errors: 0, Skipped: 0, Time elapsed: 0.221 sec - in org.apache.juneau.a.rttests.RoundTripMapsTest
Running org.apache.juneau.a.rttests.RoundTripPrimitivesBeansTest
Tests run: 44, Failures: 0, Errors: 0, Skipped: 0, Time elapsed: 0.66 sec - in org.apache.juneau.a.rttests.RoundTripPrimitivesBeansTest
Running org.apache.juneau.csv.CsvTest
Tests run: 1, Failures: 0, Errors: 0, Skipped: 0, Time elapsed: 0.002 sec - in org.apache.juneau.csv.CsvTest
Running org.apache.juneau.PropertyStoreTest
Tests run: 9, Failures: 0, Errors: 0, Skipped: 0, Time elapsed: 0.08 sec - in org.apache.juneau.PropertyStoreTest
Running org.apache.juneau.serializer.SerializerGroupTest
Tests run: 3, Failures: 0, Errors: 0, Skipped: 0, Time elapsed: 0.021 sec - in org.apache.juneau.serializer.SerializerGroupTest
Running org.apache.juneau.ParserGenericsTest
Tests run: 2, Failures: 0, Errors: 0, Skipped: 0, Time elapsed: 0.004 sec - in org.apache.juneau.ParserGenericsTest
Running org.apache.juneau.VisibilityTest
Tests run: 1, Failures: 0, Errors: 0, Skipped: 0, Time elapsed: 0.065 sec - in org.apache.juneau.VisibilityTest
Running org.apache.juneau.https.MediaRangeTest
Tests run: 17, Failures: 0, Errors: 0, Skipped: 0, Time elapsed: 0.006 sec - in org.apache.juneau.https.MediaRangeTest
Running org.apache.juneau.https.AcceptExtensionsTest
Tests run: 2, Failures: 0, Errors: 0, Skipped: 0, Time elapsed: 0.001 sec - in org.apache.juneau.https.AcceptExtensionsTest
Running org.apache.juneau.https.AcceptTest
Tests run: 46, Failures: 0, Errors: 0, Skipped: 0, Time elapsed: 0.012 sec - in org.apache.juneau.https.AcceptTest
Running org.apache.juneau.AnnotationsTest
Tests run: 2, Failures: 0, Errors: 0, Skipped: 0, Time elapsed: 0.001 sec - in org.apache.juneau.AnnotationsTest
Running org.apache.juneau.JacocoDummyTest
Tests run: 1, Failures: 0, Errors: 0, Skipped: 0, Time elapsed: 0 sec - in org.apache.juneau.JacocoDummyTest
Running org.apache.juneau.PropertyNamerDashedLcTest
Tests run: 1, Failures: 0, Errors: 0, Skipped: 0, Time elapsed: 0 sec - in org.apache.juneau.PropertyNamerDashedLcTest
Running org.apache.juneau.BeanMapTest
Tests run: 36, Failures: 0, Errors: 0, Skipped: 0, Time elapsed: 0.106 sec - in org.apache.juneau.BeanMapTest
Running org.apache.juneau.utils.ArrayUtilsTest
Tests run: 7, Failures: 0, Errors: 0, Skipped: 0, Time elapsed: 0.001 sec - in org.apache.juneau.utils.ArrayUtilsTest
Running org.apache.juneau.utils.UriContextUriComboTest
Tests run: 70, Failures: 0, Errors: 0, Skipped: 0, Time elapsed: 0.005 sec - in org.apache.juneau.utils.UriContextUriComboTest
Running org.apache.juneau.utils.StringVarResolverTest
Tests run: 7, Failures: 0, Errors: 0, Skipped: 0, Time elapsed: 0.004 sec - in org.apache.juneau.utils.StringVarResolverTest
Running org.apache.juneau.utils.ByteArrayInOutStreamTest
Tests run: 1, Failures: 0, Errors: 0, Skipped: 0, Time elapsed: 0 sec - in org.apache.juneau.utils.ByteArrayInOutStreamTest
Running org.apache.juneau.utils.PojoQueryTest
Tests run: 9, Failures: 0, Errors: 0, Skipped: 0, Time elapsed: 0.057 sec - in org.apache.juneau.utils.PojoQueryTest
Running org.apache.juneau.utils.SimpleMapTest
Tests run: 1, Failures: 0, Errors: 0, Skipped: 0, Time elapsed: 0.002 sec - in org.apache.juneau.utils.SimpleMapTest
Running org.apache.juneau.utils.IOPipeTest
Tests run: 5, Failures: 0, Errors: 0, Skipped: 0, Time elapsed: 0.006 sec - in org.apache.juneau.utils.IOPipeTest
Running org.apache.juneau.utils.ByteArrayCacheTest
Tests run: 1, Failures: 0, Errors: 0, Skipped: 0, Time elapsed: 0.001 sec - in org.apache.juneau.utils.ByteArrayCacheTest
Running org.apache.juneau.utils.UriContextResolutionComboTest
Tests run: 240, Failures: 0, Errors: 0, Skipped: 0, Time elapsed: 0.051 sec - in org.apache.juneau.utils.UriContextResolutionComboTest
Running org.apache.juneau.utils.StringBuilderWriterTest
Tests run: 1, Failures: 0, Errors: 0, Skipped: 0, Time elapsed: 0 sec - in org.apache.juneau.utils.StringBuilderWriterTest
Running org.apache.juneau.utils.MultiSetTest
Tests run: 1, Failures: 0, Errors: 0, Skipped: 0, Time elapsed: 0 sec - in org.apache.juneau.utils.MultiSetTest
Running org.apache.juneau.utils.PojoIntrospectorTest
Tests run: 1, Failures: 0, Errors: 0, Skipped: 0, Time elapsed: 0 sec - in org.apache.juneau.utils.PojoIntrospectorTest
Running org.apache.juneau.utils.PojoRestTest
Tests run: 10, Failures: 0, Errors: 0, Skipped: 0, Time elapsed: 0.025 sec - in org.apache.juneau.utils.PojoRestTest
Running org.apache.juneau.utils.MultiIterableTest
Tests run: 1, Failures: 0, Errors: 0, Skipped: 0, Time elapsed: 0.001 sec - in org.apache.juneau.utils.MultiIterableTest
Running org.apache.juneau.utils.CollectionUtilsTest
Tests run: 1, Failures: 0, Errors: 0, Skipped: 0, Time elapsed: 0 sec - in org.apache.juneau.utils.CollectionUtilsTest
Running org.apache.juneau.utils.KeywordStoreTest
Tests run: 1, Failures: 0, Errors: 0, Skipped: 0, Time elapsed: 0 sec - in org.apache.juneau.utils.KeywordStoreTest
Running org.apache.juneau.utils.FilteredMapTest
Tests run: 1, Failures: 0, Errors: 0, Skipped: 0, Time elapsed: 0 sec - in org.apache.juneau.utils.FilteredMapTest
Running org.apache.juneau.utils.ArgsTest
Tests run: 1, Failures: 0, Errors: 0, Skipped: 0, Time elapsed: 0 sec - in org.apache.juneau.utils.ArgsTest
Running org.apache.juneau.utils.StringUtilsTest
Tests run: 22, Failures: 0, Errors: 0, Skipped: 0, Time elapsed: 0.027 sec - in org.apache.juneau.utils.StringUtilsTest
Running org.apache.juneau.utils.ClassUtilsTest
Tests run: 4, Failures: 0, Errors: 0, Skipped: 0, Time elapsed: 0.003 sec - in org.apache.juneau.utils.ClassUtilsTest
Running org.apache.juneau.utils.CharSetTest
Tests run: 1, Failures: 0, Errors: 0, Skipped: 0, Time elapsed: 0 sec - in org.apache.juneau.utils.CharSetTest
Running org.apache.juneau.utils.IdentityListTest
Tests run: 1, Failures: 0, Errors: 0, Skipped: 0, Time elapsed: 0.002 sec - in org.apache.juneau.utils.IdentityListTest
Running org.apache.juneau.utils.ParserReaderTest
Tests run: 1, Failures: 0, Errors: 0, Skipped: 0, Time elapsed: 0 sec - in org.apache.juneau.utils.ParserReaderTest
Running org.apache.juneau.utils.IOUtilsTest
Tests run: 1, Failures: 0, Errors: 0, Skipped: 0, Time elapsed: 0 sec - in org.apache.juneau.utils.IOUtilsTest
Running org.apache.juneau.xml.CommonXmlTest
Tests run: 2, Failures: 0, Errors: 0, Skipped: 0, Time elapsed: 0.013 sec - in org.apache.juneau.xml.CommonXmlTest
Running org.apache.juneau.xml.XmlCollapsedTest
Tests run: 9, Failures: 0, Errors: 0, Skipped: 0, Time elapsed: 0.064 sec - in org.apache.juneau.xml.XmlCollapsedTest
Running org.apache.juneau.xml.CommonParserTest
Tests run: 4, Failures: 0, Errors: 0, Skipped: 0, Time elapsed: 0.01 sec - in org.apache.juneau.xml.CommonParserTest
Running org.apache.juneau.xml.XmlParserTest
Tests run: 3, Failures: 0, Errors: 0, Skipped: 0, Time elapsed: 0.005 sec - in org.apache.juneau.xml.XmlParserTest
Running org.apache.juneau.xml.XmlTest
Tests run: 27, Failures: 0, Errors: 0, Skipped: 0, Time elapsed: 0.365 sec - in org.apache.juneau.xml.XmlTest
Running org.apache.juneau.xml.XmlContentTest
Tests run: 2, Failures: 0, Errors: 0, Skipped: 0, Time elapsed: 0.011 sec - in org.apache.juneau.xml.XmlContentTest
Running org.apache.juneau.xml.CommonTest
Tests run: 9, Failures: 0, Errors: 0, Skipped: 0, Time elapsed: 0.096 sec - in org.apache.juneau.xml.CommonTest
Running org.apache.juneau.xml.InvalidXmlBeansTest
Tests run: 15, Failures: 0, Errors: 0, Skipped: 0, Time elapsed: 0.014 sec - in org.apache.juneau.xml.InvalidXmlBeansTest
Running org.apache.juneau.xml.BasicXmlTest
Tests run: 384, Failures: 0, Errors: 0, Skipped: 0, Time elapsed: 0.224 sec - in org.apache.juneau.xml.BasicXmlTest
Running org.apache.juneau.DataConversionTest
Tests run: 2, Failures: 0, Errors: 0, Skipped: 0, Time elapsed: 0 sec - in org.apache.juneau.DataConversionTest
Running org.apache.juneau.encoders.EncoderGroupTest
Tests run: 2, Failures: 0, Errors: 0, Skipped: 0, Time elapsed: 0 sec - in org.apache.juneau.encoders.EncoderGroupTest
Running org.apache.juneau.parser.ParserGroupTest
Tests run: 2, Failures: 0, Errors: 0, Skipped: 0, Time elapsed: 0.009 sec - in org.apache.juneau.parser.ParserGroupTest
Running org.apache.juneau.jena.CommonXmlTest
Tests run: 2, Failures: 0, Errors: 0, Skipped: 0, Time elapsed: 0.005 sec - in org.apache.juneau.jena.CommonXmlTest
Running org.apache.juneau.jena.RdfParserTest
Tests run: 1, Failures: 0, Errors: 0, Skipped: 0, Time elapsed: 0.016 sec - in org.apache.juneau.jena.RdfParserTest
Running org.apache.juneau.jena.CommonParserTest
log4j:WARN No appenders could be found for logger (com.hp.hpl.jena.rdf.model.impl.RDFDefaultErrorHandler).
log4j:WARN Please initialize the log4j system properly.
log4j:WARN See http://logging.apache.org/log4j/1.2/faq.html#noconfig for more info.
Tests run: 4, Failures: 0, Errors: 0, Skipped: 0, Time elapsed: 0.024 sec - in org.apache.juneau.jena.CommonParserTest
Running org.apache.juneau.jena.RdfTest
Tests run: 4, Failures: 0, Errors: 0, Skipped: 0, Time elapsed: 0.091 sec - in org.apache.juneau.jena.RdfTest
Running org.apache.juneau.jena.CommonTest
Tests run: 9, Failures: 0, Errors: 0, Skipped: 0, Time elapsed: 0.105 sec - in org.apache.juneau.jena.CommonTest
Running org.apache.juneau.ClassMetaTest
Tests run: 7, Failures: 0, Errors: 0, Skipped: 0, Time elapsed: 0.01 sec - in org.apache.juneau.ClassMetaTest
Running org.apache.juneau.BeanConfigTest
Tests run: 11, Failures: 0, Errors: 0, Skipped: 0, Time elapsed: 0.37 sec - in org.apache.juneau.BeanConfigTest
Running org.apache.juneau.html.CommonParserTest
Tests run: 4, Failures: 0, Errors: 0, Skipped: 0, Time elapsed: 0.017 sec - in org.apache.juneau.html.CommonParserTest
Running org.apache.juneau.html.CommonTest
Tests run: 10, Failures: 0, Errors: 0, Skipped: 0, Time elapsed: 0.207 sec - in org.apache.juneau.html.CommonTest
Running org.apache.juneau.html.HtmlTest
Tests run: 5, Failures: 0, Errors: 0, Skipped: 0, Time elapsed: 0.02 sec - in org.apache.juneau.html.HtmlTest
Running org.apache.juneau.html.BasicHtmlTest
Tests run: 504, Failures: 0, Errors: 0, Skipped: 0, Time elapsed: 0.406 sec - in org.apache.juneau.html.BasicHtmlTest
Running org.apache.juneau.ParserReaderTest
Tests run: 5, Failures: 0, Errors: 0, Skipped: 0, Time elapsed: 0 sec - in org.apache.juneau.ParserReaderTest

Results :

Tests run: 15034, Failures: 0, Errors: 0, Skipped: 2

[INFO] 
[INFO] --- jacoco-maven-plugin:0.7.2.201409121644:report (default-report) @ juneau-core-test
---
[INFO] Analyzed bundle 'Apache Juneau Core Tests' with 0 classes
[INFO] 
[INFO] --- maven-bundle-plugin:3.2.0:bundle (default-bundle) @ juneau-core-test ---
[INFO] 
[INFO] --- maven-site-plugin:3.5.1:attach-descriptor (attach-descriptor) @ juneau-core-test
---
[INFO] 
[INFO] --- apache-rat-plugin:0.12:check (default) @ juneau-core-test ---
[INFO] Enabled default license matchers.
[INFO] Will parse SCM ignores for exclusions...
[INFO] Parsing exclusions from <https://builds.apache.org/job/Juneau-Java-1.7/ws/juneau-core-test/.gitignore>
[INFO] Finished adding exclusions from SCM ignore files.
[INFO] 64 implicit excludes (use -debug for more details).
[INFO] Exclude: **/target/**
[INFO] 156 resources included (use -debug for more details)
[INFO] Rat check: Summary over all files. Unapproved: 1, unknown: 1, generated: 0, approved:
155 licenses.
[INFO] Enabled default license matchers.
[INFO] Will parse SCM ignores for exclusions...
[INFO] Parsing exclusions from <https://builds.apache.org/job/Juneau-Java-1.7/ws/juneau-core-test/.gitignore>
[INFO] Finished adding exclusions from SCM ignore files.
[INFO] 64 implicit excludes (use -debug for more details).
[INFO] Exclude: **/target/**
[INFO] 156 resources included (use -debug for more details)
[WARNING] Files with unapproved licenses:
  <https://builds.apache.org/job/Juneau-Java-1.7/ws/juneau-core-test/src/main/java/.gitkeep>
[INFO] ------------------------------------------------------------------------
[INFO] Reactor Summary:
[INFO] 
[INFO] Apache Juneau (incubating) ......................... SUCCESS [  8.961 s]
[INFO] Apache Juneau Core ................................. SUCCESS [ 36.161 s]
[INFO] Apache Juneau Core RDF Support ..................... SUCCESS [ 11.306 s]
[INFO] Apache Juneau Core Tests ........................... FAILURE [ 45.315 s]
[INFO] Apache Juneau REST Servlet API ..................... SKIPPED
[INFO] Apache Juneau REST JAX/RS API ...................... SKIPPED
[INFO] Apache Juneau REST Client API ...................... SKIPPED
[INFO] Apache Juneau Microservice ......................... SKIPPED
[INFO] Apache Juneau REST Examples ........................ SKIPPED
[INFO] Apache Juneau REST Tests ........................... SKIPPED
[INFO] Apache Juneau UberJar .............................. SKIPPED
[INFO] Apache Juneau Distribution ......................... SKIPPED
[INFO] ------------------------------------------------------------------------
[INFO] BUILD FAILURE
[INFO] ------------------------------------------------------------------------
[INFO] Total time: 01:43 min
[INFO] Finished at: 2017-05-22T00:28:12+00:00
[INFO] Final Memory: 64M/2583M
[INFO] ------------------------------------------------------------------------
[ERROR] Failed to execute goal org.apache.rat:apache-rat-plugin:0.12:check (default) on project
juneau-core-test: Too many files with unapproved license: 1 See RAT report in: <https://builds.apache.org/job/Juneau-Java-1.7/ws/juneau-core-test/target/rat.txt>
-> [Help 1]
[ERROR] 
[ERROR] To see the full stack trace of the errors, re-run Maven with the -e switch.
[ERROR] Re-run Maven using the -X switch to enable full debug logging.
[ERROR] 
[ERROR] For more information about the errors and possible solutions, please read the following
articles:
[ERROR] [Help 1] http://cwiki.apache.org/confluence/display/MAVEN/MojoFailureException
[ERROR] 
[ERROR] After correcting the problems, you can resume the build with the command
[ERROR]   mvn <goals> -rf :juneau-core-test
Build step 'Invoke top-level Maven targets' marked build as failure

Mime
View raw message