juneau-dev mailing list archives

Site index · List index
Message view « Date » · « Thread »
Top « Date » · « Thread »
From Apache Jenkins Server <jenk...@builds.apache.org>
Subject Build failed in Jenkins: Juneau-Java-1.7 #279
Date Wed, 03 May 2017 16:43:04 GMT
See <https://builds.apache.org/job/Juneau-Java-1.7/279/display/redirect>

------------------------------------------
Started by an SCM change
[EnvInject] - Loading node environment variables.
Building remotely on qnode2 (ubuntu) in workspace <https://builds.apache.org/job/Juneau-Java-1.7/ws/>
 > git rev-parse --is-inside-work-tree # timeout=10
Fetching changes from the remote Git repository
 > git config remote.origin.url https://git-wip-us.apache.org/repos/asf/incubator-juneau.git
# timeout=10
Fetching upstream changes from https://git-wip-us.apache.org/repos/asf/incubator-juneau.git
 > git --version # timeout=10
 > git fetch --tags --progress https://git-wip-us.apache.org/repos/asf/incubator-juneau.git
+refs/heads/*:refs/remotes/origin/*
 > git rev-parse refs/remotes/origin/master^{commit} # timeout=10
 > git rev-parse refs/remotes/origin/origin/master^{commit} # timeout=10
Checking out Revision 7a416ffa992be36f51a68f55e9212d718e403605 (refs/remotes/origin/master)
 > git config core.sparsecheckout # timeout=10
 > git checkout -f 7a416ffa992be36f51a68f55e9212d718e403605
 > git rev-list 7a416ffa992be36f51a68f55e9212d718e403605 # timeout=10
[Juneau-Java-1.7] $ /home/jenkins/tools/maven/apache-maven-3.2.5/bin/mvn clean install deploy
[INFO] Scanning for projects...
[INFO] ------------------------------------------------------------------------
[INFO] Reactor Build Order:
[INFO] 
[INFO] Apache Juneau (incubating)
[INFO] Apache Juneau Core
[INFO] Apache Juneau Core RDF Support
[INFO] Apache Juneau Core Tests
[INFO] Apache Juneau REST Servlet API
[INFO] Apache Juneau REST JAX/RS API
[INFO] Apache Juneau REST Client API
[INFO] Apache Juneau Microservice
[INFO] Apache Juneau REST Examples
[INFO] Apache Juneau REST Tests
[INFO] Apache Juneau UberJar
[INFO] Apache Juneau Distribution
[INFO]                                                                         
[INFO] ------------------------------------------------------------------------
[INFO] Building Apache Juneau (incubating) 6.2.1-incubating-SNAPSHOT
[INFO] ------------------------------------------------------------------------
[INFO] 
[INFO] --- maven-clean-plugin:3.0.0:clean (default-clean) @ juneau ---
[INFO] Deleting <https://builds.apache.org/job/Juneau-Java-1.7/ws/target>
[INFO] 
[INFO] --- maven-enforcer-plugin:1.4.1:enforce (enforce-maven) @ juneau ---
[INFO] 
[INFO] --- maven-remote-resources-plugin:1.5:process (process-resource-bundles) @ juneau ---
[INFO] 
[INFO] --- maven-site-plugin:3.5.1:attach-descriptor (attach-descriptor) @ juneau ---
[INFO] 
[INFO] --- apache-rat-plugin:0.12:check (default) @ juneau ---
[INFO] Enabled default license matchers.
[INFO] Will parse SCM ignores for exclusions...
[INFO] Parsing exclusions from <https://builds.apache.org/job/Juneau-Java-1.7/ws/.gitignore>
[INFO] Finished adding exclusions from SCM ignore files.
[INFO] 79 implicit excludes (use -debug for more details).
[INFO] Exclude: **/target/**
[INFO] 30 resources included (use -debug for more details)
[INFO] Rat check: Summary over all files. Unapproved: 0, unknown: 0, generated: 0, approved:
26 licenses.
[INFO] 
[INFO] --- maven-install-plugin:2.5.2:install (default-install) @ juneau ---
[INFO] Installing <https://builds.apache.org/job/Juneau-Java-1.7/ws/pom.xml> to /home/jenkins/.m2/repository/org/apache/juneau/juneau/6.2.1-incubating-SNAPSHOT/juneau-6.2.1-incubating-SNAPSHOT.pom
[INFO] 
[INFO] --- maven-enforcer-plugin:1.4.1:enforce (enforce-maven) @ juneau ---
[INFO] 
[INFO] --- maven-remote-resources-plugin:1.5:process (process-resource-bundles) @ juneau ---
[INFO] 
[INFO] --- maven-site-plugin:3.5.1:attach-descriptor (attach-descriptor) @ juneau ---
[INFO] 
[INFO] --- apache-rat-plugin:0.12:check (default) @ juneau ---
[INFO] Enabled default license matchers.
[INFO] Will parse SCM ignores for exclusions...
[INFO] Parsing exclusions from <https://builds.apache.org/job/Juneau-Java-1.7/ws/.gitignore>
[INFO] Finished adding exclusions from SCM ignore files.
[INFO] 79 implicit excludes (use -debug for more details).
[INFO] Exclude: **/target/**
[INFO] 30 resources included (use -debug for more details)
[INFO] Rat check: Summary over all files. Unapproved: 0, unknown: 0, generated: 0, approved:
26 licenses.
[INFO] 
[INFO] --- maven-install-plugin:2.5.2:install (default-install) @ juneau ---
[INFO] Installing <https://builds.apache.org/job/Juneau-Java-1.7/ws/pom.xml> to /home/jenkins/.m2/repository/org/apache/juneau/juneau/6.2.1-incubating-SNAPSHOT/juneau-6.2.1-incubating-SNAPSHOT.pom
[INFO] 
[INFO] --- maven-deploy-plugin:2.8.2:deploy (default-deploy) @ juneau ---
Downloading: https://repository.apache.org/content/repositories/snapshots/org/apache/juneau/juneau/6.2.1-incubating-SNAPSHOT/maven-metadata.xml
624/624 B               Downloaded: https://repository.apache.org/content/repositories/snapshots/org/apache/juneau/juneau/6.2.1-incubating-SNAPSHOT/maven-metadata.xml
(624 B at 0.4 KB/sec)
Uploading: https://repository.apache.org/content/repositories/snapshots/org/apache/juneau/juneau/6.2.1-incubating-SNAPSHOT/juneau-6.2.1-incubating-20170503.164254-15.pom
2/10 KB     4/10 KB   6/10 KB   8/10 KB   10/10 KB              Uploaded: https://repository.apache.org/content/repositories/snapshots/org/apache/juneau/juneau/6.2.1-incubating-SNAPSHOT/juneau-6.2.1-incubating-20170503.164254-15.pom
(10 KB at 8.6 KB/sec)
Downloading: https://repository.apache.org/content/repositories/snapshots/org/apache/juneau/juneau/maven-metadata.xml
467/467 B               Downloaded: https://repository.apache.org/content/repositories/snapshots/org/apache/juneau/juneau/maven-metadata.xml
(467 B at 0.8 KB/sec)
Uploading: https://repository.apache.org/content/repositories/snapshots/org/apache/juneau/juneau/6.2.1-incubating-SNAPSHOT/maven-metadata.xml
624/624 B               Uploaded: https://repository.apache.org/content/repositories/snapshots/org/apache/juneau/juneau/6.2.1-incubating-SNAPSHOT/maven-metadata.xml
(624 B at 0.7 KB/sec)
Uploading: https://repository.apache.org/content/repositories/snapshots/org/apache/juneau/juneau/maven-metadata.xml
467/467 B               Uploaded: https://repository.apache.org/content/repositories/snapshots/org/apache/juneau/juneau/maven-metadata.xml
(467 B at 0.5 KB/sec)
[INFO]                                                                         
[INFO] ------------------------------------------------------------------------
[INFO] Building Apache Juneau Core 6.2.1-incubating-SNAPSHOT
[INFO] ------------------------------------------------------------------------
[INFO] 
[INFO] --- maven-clean-plugin:3.0.0:clean (default-clean) @ juneau-core ---
[INFO] Deleting <https://builds.apache.org/job/Juneau-Java-1.7/ws/juneau-core/target>
[INFO] 
[INFO] --- maven-enforcer-plugin:1.4.1:enforce (enforce-maven) @ juneau-core ---
[INFO] 
[INFO] --- jacoco-maven-plugin:0.7.2.201409121644:prepare-agent (default-prepare-agent) @
juneau-core ---
[INFO] argLine set to -javaagent:/home/jenkins/.m2/repository/org/jacoco/org.jacoco.agent/0.7.2.201409121644/org.jacoco.agent-0.7.2.201409121644-runtime.jar=destfile=<https://builds.apache.org/job/Juneau-Java-1.7/ws/juneau-core/target/jacoco.exec>
[INFO] 
[INFO] --- maven-remote-resources-plugin:1.5:process (process-resource-bundles) @ juneau-core
---
[INFO] 
[INFO] --- maven-resources-plugin:2.7:resources (default-resources) @ juneau-core ---
[INFO] Using 'UTF-8' encoding to copy filtered resources.
[INFO] skip non existing resourceDirectory <https://builds.apache.org/job/Juneau-Java-1.7/ws/juneau-core/src/main/resources>
[INFO] Copying 3 resources
[INFO] 
[INFO] --- maven-compiler-plugin:3.5.1:compile (default-compile) @ juneau-core ---
[INFO] No sources to compile
[INFO] 
[INFO] --- maven-resources-plugin:2.7:testResources (default-testResources) @ juneau-core
---
[INFO] Using 'UTF-8' encoding to copy filtered resources.
[INFO] skip non existing resourceDirectory <https://builds.apache.org/job/Juneau-Java-1.7/ws/juneau-core/src/test/resources>
[INFO] Copying 3 resources
[INFO] 
[INFO] --- maven-compiler-plugin:3.5.1:testCompile (default-testCompile) @ juneau-core ---
[INFO] No sources to compile
[INFO] 
[INFO] --- maven-surefire-plugin:2.19.1:test (default-test) @ juneau-core ---
[INFO] 
[INFO] --- jacoco-maven-plugin:0.7.2.201409121644:report (default-report) @ juneau-core ---
[INFO] Skipping JaCoCo execution due to missing execution data <https://builds.apache.org/job/Juneau-Java-1.7/ws/juneau-core/target/jacoco.exec>
[INFO] 
[INFO] --- maven-bundle-plugin:3.2.0:bundle (default-bundle) @ juneau-core ---
[INFO] 
[INFO] --- maven-site-plugin:3.5.1:attach-descriptor (attach-descriptor) @ juneau-core ---
[INFO] 
[INFO] --- apache-rat-plugin:0.12:check (default) @ juneau-core ---
[INFO] Enabled default license matchers.
[INFO] Will parse SCM ignores for exclusions...
[INFO] Finished adding exclusions from SCM ignore files.
[INFO] 61 implicit excludes (use -debug for more details).
[INFO] Exclude: **/target/**
[WARNING] No resources included.
[INFO] Rat check: Summary over all files. Unapproved: 0, unknown: 0, generated: 0, approved:
0 license.
[INFO] 
[INFO] --- maven-source-plugin:3.0.1:jar-no-fork (attach-sources) @ juneau-core ---
[INFO] ------------------------------------------------------------------------
[INFO] Reactor Summary:
[INFO] 
[INFO] Apache Juneau (incubating) ......................... SUCCESS [ 10.702 s]
[INFO] Apache Juneau Core ................................. FAILURE [  5.626 s]
[INFO] Apache Juneau Core RDF Support ..................... SKIPPED
[INFO] Apache Juneau Core Tests ........................... SKIPPED
[INFO] Apache Juneau REST Servlet API ..................... SKIPPED
[INFO] Apache Juneau REST JAX/RS API ...................... SKIPPED
[INFO] Apache Juneau REST Client API ...................... SKIPPED
[INFO] Apache Juneau Microservice ......................... SKIPPED
[INFO] Apache Juneau REST Examples ........................ SKIPPED
[INFO] Apache Juneau REST Tests ........................... SKIPPED
[INFO] Apache Juneau UberJar .............................. SKIPPED
[INFO] Apache Juneau Distribution ......................... SKIPPED
[INFO] ------------------------------------------------------------------------
[INFO] BUILD FAILURE
[INFO] ------------------------------------------------------------------------
[INFO] Total time: 19.389 s
[INFO] Finished at: 2017-05-03T16:43:03+00:00
[INFO] Final Memory: 32M/621M
[INFO] ------------------------------------------------------------------------
[ERROR] Failed to execute goal org.apache.maven.plugins:maven-source-plugin:3.0.1:jar-no-fork
(attach-sources) on project juneau-core: Error creating source archive: <https://builds.apache.org/job/Juneau-Java-1.7/ws/juneau-core/pom.xml>
isn't a file. -> [Help 1]
[ERROR] 
[ERROR] To see the full stack trace of the errors, re-run Maven with the -e switch.
[ERROR] Re-run Maven using the -X switch to enable full debug logging.
[ERROR] 
[ERROR] For more information about the errors and possible solutions, please read the following
articles:
[ERROR] [Help 1] http://cwiki.apache.org/confluence/display/MAVEN/MojoExecutionException
[ERROR] 
[ERROR] After correcting the problems, you can resume the build with the command
[ERROR]   mvn <goals> -rf :juneau-core
Build step 'Invoke top-level Maven targets' marked build as failure

Mime
View raw message