juneau-dev mailing list archives

Site index · List index
Message view « Date » · « Thread »
Top « Date » · « Thread »
From Apache Jenkins Server <jenk...@builds.apache.org>
Subject Build failed in Jenkins: Juneau-Java-1.7 #206
Date Fri, 17 Mar 2017 02:24:20 GMT
See <https://builds.apache.org/job/Juneau-Java-1.7/206/display/redirect?page=changes>

Changes:

[jamesbognar] Allow @RestResource/@RestMethod annotations to be used on any classes.

------------------------------------------
[...truncated 101.65 KB...]
Tests run: 1, Failures: 0, Errors: 0, Skipped: 0, Time elapsed: 0 sec - in org.apache.juneau.utils.CollectionUtilsTest
Running org.apache.juneau.utils.KeywordStoreTest
Tests run: 1, Failures: 0, Errors: 0, Skipped: 0, Time elapsed: 0 sec - in org.apache.juneau.utils.KeywordStoreTest
Running org.apache.juneau.utils.FilteredMapTest
Tests run: 1, Failures: 0, Errors: 0, Skipped: 0, Time elapsed: 0 sec - in org.apache.juneau.utils.FilteredMapTest
Running org.apache.juneau.utils.ArgsTest
Tests run: 1, Failures: 0, Errors: 0, Skipped: 0, Time elapsed: 0 sec - in org.apache.juneau.utils.ArgsTest
Running org.apache.juneau.utils.StringUtilsTest
Tests run: 19, Failures: 0, Errors: 0, Skipped: 0, Time elapsed: 0.016 sec - in org.apache.juneau.utils.StringUtilsTest
Running org.apache.juneau.utils.ClassUtilsTest
Tests run: 4, Failures: 0, Errors: 0, Skipped: 0, Time elapsed: 0.001 sec - in org.apache.juneau.utils.ClassUtilsTest
Running org.apache.juneau.utils.CharSetTest
Tests run: 1, Failures: 0, Errors: 0, Skipped: 0, Time elapsed: 0 sec - in org.apache.juneau.utils.CharSetTest
Running org.apache.juneau.utils.IdentityListTest
Tests run: 1, Failures: 0, Errors: 0, Skipped: 0, Time elapsed: 0 sec - in org.apache.juneau.utils.IdentityListTest
Running org.apache.juneau.utils.ParserReaderTest
Tests run: 1, Failures: 0, Errors: 0, Skipped: 0, Time elapsed: 0 sec - in org.apache.juneau.utils.ParserReaderTest
Running org.apache.juneau.utils.IOUtilsTest
Tests run: 1, Failures: 0, Errors: 0, Skipped: 0, Time elapsed: 0.001 sec - in org.apache.juneau.utils.IOUtilsTest
Running org.apache.juneau.xml.CommonXmlTest
Tests run: 2, Failures: 0, Errors: 0, Skipped: 0, Time elapsed: 0.01 sec - in org.apache.juneau.xml.CommonXmlTest
Running org.apache.juneau.xml.XmlCollapsedTest
Tests run: 9, Failures: 0, Errors: 0, Skipped: 0, Time elapsed: 0.068 sec - in org.apache.juneau.xml.XmlCollapsedTest
Running org.apache.juneau.xml.CommonParserTest
Tests run: 4, Failures: 0, Errors: 0, Skipped: 0, Time elapsed: 0.01 sec - in org.apache.juneau.xml.CommonParserTest
Running org.apache.juneau.xml.XmlParserTest
Tests run: 3, Failures: 0, Errors: 0, Skipped: 0, Time elapsed: 0.005 sec - in org.apache.juneau.xml.XmlParserTest
Running org.apache.juneau.xml.XmlTest
Tests run: 27, Failures: 0, Errors: 0, Skipped: 0, Time elapsed: 0.428 sec - in org.apache.juneau.xml.XmlTest
Running org.apache.juneau.xml.XmlContentTest
Tests run: 2, Failures: 0, Errors: 0, Skipped: 0, Time elapsed: 0.011 sec - in org.apache.juneau.xml.XmlContentTest
Running org.apache.juneau.xml.CommonTest
Tests run: 9, Failures: 0, Errors: 0, Skipped: 0, Time elapsed: 0.097 sec - in org.apache.juneau.xml.CommonTest
Running org.apache.juneau.xml.InvalidXmlBeansTest
Tests run: 15, Failures: 0, Errors: 0, Skipped: 0, Time elapsed: 0.013 sec - in org.apache.juneau.xml.InvalidXmlBeansTest
Running org.apache.juneau.xml.BasicXmlTest
Tests run: 384, Failures: 0, Errors: 0, Skipped: 0, Time elapsed: 0.443 sec - in org.apache.juneau.xml.BasicXmlTest
Running org.apache.juneau.DataConversionTest
Tests run: 2, Failures: 0, Errors: 0, Skipped: 0, Time elapsed: 0 sec - in org.apache.juneau.DataConversionTest
Running org.apache.juneau.MediaRangeTest
Tests run: 17, Failures: 0, Errors: 0, Skipped: 0, Time elapsed: 0 sec - in org.apache.juneau.MediaRangeTest
Running org.apache.juneau.jena.CommonXmlTest
Tests run: 2, Failures: 0, Errors: 0, Skipped: 0, Time elapsed: 0.006 sec - in org.apache.juneau.jena.CommonXmlTest
Running org.apache.juneau.jena.RdfParserTest
Tests run: 1, Failures: 0, Errors: 0, Skipped: 0, Time elapsed: 0.02 sec - in org.apache.juneau.jena.RdfParserTest
Running org.apache.juneau.jena.CommonParserTest
log4j:WARN No appenders could be found for logger (com.hp.hpl.jena.rdf.model.impl.RDFDefaultErrorHandler).
log4j:WARN Please initialize the log4j system properly.
log4j:WARN See http://logging.apache.org/log4j/1.2/faq.html#noconfig for more info.
Tests run: 4, Failures: 0, Errors: 0, Skipped: 0, Time elapsed: 0.027 sec - in org.apache.juneau.jena.CommonParserTest
Running org.apache.juneau.jena.RdfTest
Tests run: 4, Failures: 0, Errors: 0, Skipped: 0, Time elapsed: 0.103 sec - in org.apache.juneau.jena.RdfTest
Running org.apache.juneau.jena.CommonTest
Tests run: 9, Failures: 0, Errors: 0, Skipped: 0, Time elapsed: 0.128 sec - in org.apache.juneau.jena.CommonTest
Running org.apache.juneau.ClassMetaTest
Tests run: 7, Failures: 0, Errors: 0, Skipped: 0, Time elapsed: 0.013 sec - in org.apache.juneau.ClassMetaTest
Running org.apache.juneau.BeanConfigTest
Tests run: 11, Failures: 0, Errors: 0, Skipped: 0, Time elapsed: 0.251 sec - in org.apache.juneau.BeanConfigTest
Running org.apache.juneau.html.CommonParserTest
Tests run: 4, Failures: 0, Errors: 0, Skipped: 0, Time elapsed: 0.011 sec - in org.apache.juneau.html.CommonParserTest
Running org.apache.juneau.html.CommonTest
Tests run: 10, Failures: 0, Errors: 0, Skipped: 0, Time elapsed: 0.183 sec - in org.apache.juneau.html.CommonTest
Running org.apache.juneau.html.HtmlTest
Tests run: 5, Failures: 0, Errors: 0, Skipped: 0, Time elapsed: 0.01 sec - in org.apache.juneau.html.HtmlTest
Running org.apache.juneau.html.BasicHtmlTest
Tests run: 224, Failures: 0, Errors: 0, Skipped: 0, Time elapsed: 0.116 sec - in org.apache.juneau.html.BasicHtmlTest
Running org.apache.juneau.ParserReaderTest
Tests run: 5, Failures: 0, Errors: 0, Skipped: 0, Time elapsed: 0 sec - in org.apache.juneau.ParserReaderTest

Results :

Tests run: 9974, Failures: 0, Errors: 0, Skipped: 2

[INFO] 
[INFO] --- jacoco-maven-plugin:0.7.2.201409121644:report (default-report) @ juneau-core-test
---
[INFO] Analyzed bundle 'Apache Juneau Core Tests' with 0 classes
[INFO] 
[INFO] --- maven-bundle-plugin:3.2.0:bundle (default-bundle) @ juneau-core-test ---
[INFO] 
[INFO] --- maven-site-plugin:3.5.1:attach-descriptor (attach-descriptor) @ juneau-core-test
---
[INFO] 
[INFO] --- apache-rat-plugin:0.11:check (default) @ juneau-core-test ---
[INFO] 51 implicit excludes (use -debug for more details).
[INFO] Exclude: **/*.log
[INFO] Exclude: **/.idea
[INFO] Exclude: **/*.iml
[INFO] Exclude: **/*.classpath
[INFO] Exclude: **/*.settings
[INFO] Exclude: **/*.log.*
[INFO] Exclude: **/target/**
[INFO] Exclude: DEPENDENCIES
[INFO] Exclude: true
[INFO] 136 resources included (use -debug for more details)
[INFO] Rat check: Summary of files. Unapproved: 0 unknown: 0 generated: 0 approved: 136 licence.
[INFO] 
[INFO] --- maven-source-plugin:3.0.1:jar-no-fork (attach-sources) @ juneau-core-test ---
[INFO] Building jar: <https://builds.apache.org/job/Juneau-Java-1.7/ws/juneau-core-test/target/juneau-core-test-6.1.1-incubating-SNAPSHOT-sources.jar>
[INFO] 
[INFO] --- maven-install-plugin:2.5.2:install (default-install) @ juneau-core-test ---
[INFO] Installing <https://builds.apache.org/job/Juneau-Java-1.7/ws/juneau-core-test/target/juneau-core-test-6.1.1-incubating-SNAPSHOT.jar>
to /home/jenkins/.m2/repository/org/apache/juneau/juneau-core-test/6.1.1-incubating-SNAPSHOT/juneau-core-test-6.1.1-incubating-SNAPSHOT.jar
[INFO] Installing <https://builds.apache.org/job/Juneau-Java-1.7/ws/juneau-core-test/pom.xml>
to /home/jenkins/.m2/repository/org/apache/juneau/juneau-core-test/6.1.1-incubating-SNAPSHOT/juneau-core-test-6.1.1-incubating-SNAPSHOT.pom
[INFO] Installing <https://builds.apache.org/job/Juneau-Java-1.7/ws/juneau-core-test/target/juneau-core-test-6.1.1-incubating-SNAPSHOT-sources.jar>
to /home/jenkins/.m2/repository/org/apache/juneau/juneau-core-test/6.1.1-incubating-SNAPSHOT/juneau-core-test-6.1.1-incubating-SNAPSHOT-sources.jar
[INFO] 
[INFO] --- maven-bundle-plugin:3.2.0:install (default-install) @ juneau-core-test ---
[INFO] Installing org/apache/juneau/juneau-core-test/6.1.1-incubating-SNAPSHOT/juneau-core-test-6.1.1-incubating-SNAPSHOT.jar
[INFO] Writing OBR metadata
[INFO] 
[INFO] --- jacoco-maven-plugin:0.7.2.201409121644:prepare-agent (default-prepare-agent) @
juneau-core-test ---
[INFO] argLine set to -javaagent:/home/jenkins/.m2/repository/org/jacoco/org.jacoco.agent/0.7.2.201409121644/org.jacoco.agent-0.7.2.201409121644-runtime.jar=destfile=<https://builds.apache.org/job/Juneau-Java-1.7/ws/juneau-core-test/target/jacoco.exec>
[INFO] 
[INFO] --- maven-remote-resources-plugin:1.5:process (process-resource-bundles) @ juneau-core-test
---
[INFO] 
[INFO] --- maven-resources-plugin:2.7:resources (default-resources) @ juneau-core-test ---
[INFO] Using 'UTF-8' encoding to copy filtered resources.
[INFO] skip non existing resourceDirectory <https://builds.apache.org/job/Juneau-Java-1.7/ws/juneau-core-test/src/main/resources>
[INFO] Copying 3 resources
[INFO] Copying 3 resources
[INFO] 
[INFO] --- maven-compiler-plugin:3.5.1:compile (default-compile) @ juneau-core-test ---
[INFO] No sources to compile
[INFO] 
[INFO] --- maven-resources-plugin:2.7:testResources (default-testResources) @ juneau-core-test
---
[INFO] Using 'UTF-8' encoding to copy filtered resources.
[INFO] skip non existing resourceDirectory <https://builds.apache.org/job/Juneau-Java-1.7/ws/juneau-core-test/src/test/resources>
[INFO] Copying 3 resources
[INFO] Copying 3 resources
[INFO] 
[INFO] --- maven-compiler-plugin:3.5.1:testCompile (default-testCompile) @ juneau-core-test
---
[INFO] Nothing to compile - all classes are up to date
[INFO] 
[INFO] --- maven-surefire-plugin:2.19.1:test (default-test) @ juneau-core-test ---
[INFO] Skipping execution of surefire because it has already been run for this configuration
[INFO] 
[INFO] --- jacoco-maven-plugin:0.7.2.201409121644:report (default-report) @ juneau-core-test
---
[INFO] Analyzed bundle 'Apache Juneau Core Tests' with 0 classes
[INFO] 
[INFO] --- maven-bundle-plugin:3.2.0:bundle (default-bundle) @ juneau-core-test ---
[INFO] 
[INFO] --- maven-site-plugin:3.5.1:attach-descriptor (attach-descriptor) @ juneau-core-test
---
[INFO] 
[INFO] --- apache-rat-plugin:0.11:check (default) @ juneau-core-test ---
[INFO] 51 implicit excludes (use -debug for more details).
[INFO] Exclude: **/*.log
[INFO] Exclude: **/.idea
[INFO] Exclude: **/*.iml
[INFO] Exclude: **/*.classpath
[INFO] Exclude: **/*.settings
[INFO] Exclude: **/*.log.*
[INFO] Exclude: **/target/**
[INFO] Exclude: DEPENDENCIES
[INFO] Exclude: true
[INFO] 136 resources included (use -debug for more details)
[INFO] Rat check: Summary of files. Unapproved: 0 unknown: 0 generated: 0 approved: 136 licence.
[INFO] 
[INFO] --- maven-source-plugin:3.0.1:jar-no-fork (attach-sources) @ juneau-core-test ---
[INFO] 
[INFO] --- maven-install-plugin:2.5.2:install (default-install) @ juneau-core-test ---
[INFO] Installing <https://builds.apache.org/job/Juneau-Java-1.7/ws/juneau-core-test/target/juneau-core-test-6.1.1-incubating-SNAPSHOT.jar>
to /home/jenkins/.m2/repository/org/apache/juneau/juneau-core-test/6.1.1-incubating-SNAPSHOT/juneau-core-test-6.1.1-incubating-SNAPSHOT.jar
[INFO] Installing <https://builds.apache.org/job/Juneau-Java-1.7/ws/juneau-core-test/pom.xml>
to /home/jenkins/.m2/repository/org/apache/juneau/juneau-core-test/6.1.1-incubating-SNAPSHOT/juneau-core-test-6.1.1-incubating-SNAPSHOT.pom
[INFO] Installing <https://builds.apache.org/job/Juneau-Java-1.7/ws/juneau-core-test/target/juneau-core-test-6.1.1-incubating-SNAPSHOT-sources.jar>
to /home/jenkins/.m2/repository/org/apache/juneau/juneau-core-test/6.1.1-incubating-SNAPSHOT/juneau-core-test-6.1.1-incubating-SNAPSHOT-sources.jar
[INFO] Installing <https://builds.apache.org/job/Juneau-Java-1.7/ws/juneau-core-test/target/juneau-core-test-6.1.1-incubating-SNAPSHOT-sources.jar>
to /home/jenkins/.m2/repository/org/apache/juneau/juneau-core-test/6.1.1-incubating-SNAPSHOT/juneau-core-test-6.1.1-incubating-SNAPSHOT-sources.jar
[INFO] 
[INFO] --- maven-bundle-plugin:3.2.0:install (default-install) @ juneau-core-test ---
[INFO] Installing org/apache/juneau/juneau-core-test/6.1.1-incubating-SNAPSHOT/juneau-core-test-6.1.1-incubating-SNAPSHOT.jar
[INFO] Writing OBR metadata
[INFO] 
[INFO] --- maven-deploy-plugin:2.8.2:deploy (default-deploy) @ juneau-core-test ---
Downloading: https://repository.apache.org/content/repositories/snapshots/org/apache/juneau/juneau-core-test/6.1.1-incubating-SNAPSHOT/maven-metadata.xml
2/2 KB            Downloaded: https://repository.apache.org/content/repositories/snapshots/org/apache/juneau/juneau-core-test/6.1.1-incubating-SNAPSHOT/maven-metadata.xml
(2 KB at 1.8 KB/sec)
Uploading: https://repository.apache.org/content/repositories/snapshots/org/apache/juneau/juneau-core-test/6.1.1-incubating-SNAPSHOT/juneau-core-test-6.1.1-incubating-20170317.022412-29.jar
2/8 KB   4/8 KB   6/8 KB   8/8 KB            Uploaded: https://repository.apache.org/content/repositories/snapshots/org/apache/juneau/juneau-core-test/6.1.1-incubating-SNAPSHOT/juneau-core-test-6.1.1-incubating-20170317.022412-29.jar
(8 KB at 9.4 KB/sec)
Uploading: https://repository.apache.org/content/repositories/snapshots/org/apache/juneau/juneau-core-test/6.1.1-incubating-SNAPSHOT/juneau-core-test-6.1.1-incubating-20170317.022412-29.pom
2/5 KB   4/5 KB   5/5 KB            Uploaded: https://repository.apache.org/content/repositories/snapshots/org/apache/juneau/juneau-core-test/6.1.1-incubating-SNAPSHOT/juneau-core-test-6.1.1-incubating-20170317.022412-29.pom
(5 KB at 5.0 KB/sec)
Downloading: https://repository.apache.org/content/repositories/snapshots/org/apache/juneau/juneau-core-test/maven-metadata.xml
426/426 B               Downloaded: https://repository.apache.org/content/repositories/snapshots/org/apache/juneau/juneau-core-test/maven-metadata.xml
(426 B at 0.8 KB/sec)
Uploading: https://repository.apache.org/content/repositories/snapshots/org/apache/juneau/juneau-core-test/6.1.1-incubating-SNAPSHOT/maven-metadata.xml
2/2 KB               Uploaded: https://repository.apache.org/content/repositories/snapshots/org/apache/juneau/juneau-core-test/6.1.1-incubating-SNAPSHOT/maven-metadata.xml
(2 KB at 1.2 KB/sec)
Uploading: https://repository.apache.org/content/repositories/snapshots/org/apache/juneau/juneau-core-test/maven-metadata.xml
426/426 B               Uploaded: https://repository.apache.org/content/repositories/snapshots/org/apache/juneau/juneau-core-test/maven-metadata.xml
(426 B at 0.5 KB/sec)
Uploading: https://repository.apache.org/content/repositories/snapshots/org/apache/juneau/juneau-core-test/6.1.1-incubating-SNAPSHOT/juneau-core-test-6.1.1-incubating-20170317.022412-29-sources.jar
2/8 KB      4/8 KB   6/8 KB   8/8 KB            Uploaded: https://repository.apache.org/content/repositories/snapshots/org/apache/juneau/juneau-core-test/6.1.1-incubating-SNAPSHOT/juneau-core-test-6.1.1-incubating-20170317.022412-29-sources.jar
(8 KB at 8.9 KB/sec)
Uploading: https://repository.apache.org/content/repositories/snapshots/org/apache/juneau/juneau-core-test/6.1.1-incubating-SNAPSHOT/maven-metadata.xml
2/2 KB            Uploaded: https://repository.apache.org/content/repositories/snapshots/org/apache/juneau/juneau-core-test/6.1.1-incubating-SNAPSHOT/maven-metadata.xml
(2 KB at 1.2 KB/sec)
Uploading: https://repository.apache.org/content/repositories/snapshots/org/apache/juneau/juneau-core-test/6.1.1-incubating-SNAPSHOT/juneau-core-test-6.1.1-incubating-20170317.022412-29-sources.jar
2/8 KB   4/8 KB   6/8 KB   8/8 KB            Uploaded: https://repository.apache.org/content/repositories/snapshots/org/apache/juneau/juneau-core-test/6.1.1-incubating-SNAPSHOT/juneau-core-test-6.1.1-incubating-20170317.022412-29-sources.jar
(8 KB at 9.2 KB/sec)
Uploading: https://repository.apache.org/content/repositories/snapshots/org/apache/juneau/juneau-core-test/6.1.1-incubating-SNAPSHOT/maven-metadata.xml
2/2 KB            Uploaded: https://repository.apache.org/content/repositories/snapshots/org/apache/juneau/juneau-core-test/6.1.1-incubating-SNAPSHOT/maven-metadata.xml
(2 KB at 1.3 KB/sec)
[INFO] 
[INFO] --- maven-bundle-plugin:3.2.0:deploy (default-deploy) @ juneau-core-test ---
[INFO] Remote OBR update disabled (enable with -DremoteOBR)
[INFO]                                                                         
[INFO] ------------------------------------------------------------------------
[INFO] Building Apache Juneau REST Servlet API 6.1.1-incubating-SNAPSHOT
[INFO] ------------------------------------------------------------------------
[INFO] 
[INFO] --- maven-clean-plugin:3.0.0:clean (default-clean) @ juneau-rest ---
[INFO] Deleting <https://builds.apache.org/job/Juneau-Java-1.7/ws/juneau-rest/target>
[INFO] 
[INFO] --- maven-remote-resources-plugin:1.5:process (process-resource-bundles) @ juneau-rest
---
[INFO] 
[INFO] --- maven-resources-plugin:2.7:resources (default-resources) @ juneau-rest ---
[INFO] Using 'UTF-8' encoding to copy filtered resources.
[INFO] Copying 6 resources
[INFO] Copying 3 resources
[INFO] 
[INFO] --- maven-compiler-plugin:3.5.1:compile (default-compile) @ juneau-rest ---
[INFO] Changes detected - recompiling the module!
[INFO] Compiling 69 source files to <https://builds.apache.org/job/Juneau-Java-1.7/ws/juneau-rest/target/classes>
[INFO] -------------------------------------------------------------
[ERROR] COMPILATION ERROR : 
[INFO] -------------------------------------------------------------
[ERROR] <https://builds.apache.org/job/Juneau-Java-1.7/ws/juneau-rest/src/main/java/org/apache/juneau/rest/RestContext.java>:[479,25]
variable initException might already have been assigned
[INFO] 1 error
[INFO] -------------------------------------------------------------
[INFO] ------------------------------------------------------------------------
[INFO] Reactor Summary:
[INFO] 
[INFO] Apache Juneau (incubating) ......................... SUCCESS [  7.126 s]
[INFO] Apache Juneau Core ................................. SUCCESS [ 28.806 s]
[INFO] Apache Juneau Core RDF Support ..................... SUCCESS [ 10.728 s]
[INFO] Apache Juneau Core Tests ........................... SUCCESS [ 36.596 s]
[INFO] Apache Juneau REST Servlet API ..................... FAILURE [  0.443 s]
[INFO] Apache Juneau REST JAX/RS API ...................... SKIPPED
[INFO] Apache Juneau REST Client API ...................... SKIPPED
[INFO] Apache Juneau Microservice ......................... SKIPPED
[INFO] Apache Juneau REST Examples ........................ SKIPPED
[INFO] Apache Juneau REST Tests ........................... SKIPPED
[INFO] Apache Juneau UberJar .............................. SKIPPED
[INFO] Apache Juneau Distribution ......................... SKIPPED
[INFO] ------------------------------------------------------------------------
[INFO] BUILD FAILURE
[INFO] ------------------------------------------------------------------------
[INFO] Total time: 01:25 min
[INFO] Finished at: 2017-03-17T02:24:19+00:00
[INFO] Final Memory: 43M/1465M
[INFO] ------------------------------------------------------------------------
[ERROR] Failed to execute goal org.apache.maven.plugins:maven-compiler-plugin:3.5.1:compile
(default-compile) on project juneau-rest: Compilation failure
[ERROR] <https://builds.apache.org/job/Juneau-Java-1.7/ws/juneau-rest/src/main/java/org/apache/juneau/rest/RestContext.java>:[479,25]
variable initException might already have been assigned
[ERROR] -> [Help 1]
[ERROR] 
[ERROR] To see the full stack trace of the errors, re-run Maven with the -e switch.
[ERROR] Re-run Maven using the -X switch to enable full debug logging.
[ERROR] 
[ERROR] For more information about the errors and possible solutions, please read the following
articles:
[ERROR] [Help 1] http://cwiki.apache.org/confluence/display/MAVEN/MojoFailureException
[ERROR] 
[ERROR] After correcting the problems, you can resume the build with the command
[ERROR]   mvn <goals> -rf :juneau-rest
Build step 'Invoke top-level Maven targets' marked build as failure

Mime
View raw message