juneau-dev mailing list archives

Site index · List index
Message view « Date » · « Thread »
Top « Date » · « Thread »
From Apache Jenkins Server <jenk...@builds.apache.org>
Subject Build failed in Jenkins: Juneau-Java-1.7 #184
Date Sun, 19 Feb 2017 15:38:41 GMT
See <https://builds.apache.org/job/Juneau-Java-1.7/184/display/redirect?page=changes>

Changes:

[jamesbognar] Eliminate spurious spaces after commas.

[jamesbognar] Bug fixes.

------------------------------------------
[...truncated 109.94 KB...]
	'$schema': 'http://schemaVersionUri',
	title: 'title',
	description: 'description',
	type: 'number',
	definitions: {
		definition: {
			'$ref': 'http://definition'
		}
	},
	properties: {
		property: {
			type: 'number'
		}
	},
	patternProperties: {
		'/pattern/': {
			type: 'number'
		}
	},
	dependencies: {
		dependency: {
			'$ref': 'http://dependency'
		}
	},
	items: [
		{
			type: 'number'
		}
	],
	multipleOf: 1,
	maximum: 2,
	exclusiveMaximum: true,
	minimum: 3,
	exclusiveMinimum: true,
	maxLength: 4,
	minLength: 5,
	pattern: '/pattern/',
	additionalItems: [
		{
			type: 'number'
		}
	],
	maxItems: 6,
	minItems: 7,
	uniqueItems: true,
	maxProperties: 8,
	minProperties: 9,
	required: [
		'required'
	],
	additionalProperties: {
		'$ref': 'http://additionalProperty'
	},
	'enum': [
		'enum'
	],
	allOf: [
		{
			'$ref': 'http://allOf'
		}
	],
	anyOf: [
		{
			'$ref': 'http://anyOf'
		}
	],
	oneOf: [
		{
			'$ref': 'http://oneOf'
		}
	],]
	not: {
		'$ref': '...>
  JsonSchemaTest.testSchema2:150 expected:<{
	id: 'http://id',[ 
	'$schema': 'http://schemaVersionUri', 
	type: [
		'string', 
		'number'
	], 
	definitions: {
		definition: {
			id: 'http://definition'
		}
	}, 
	items: [
		{
			'$ref': 'http://items'
		}
	], 
	additionalItems: true, ]
	additionalProperti...> but was:<{
	id: 'http://id',[
	'$schema': 'http://schemaVersionUri',
	type: [
		'string',
		'number'
	],
	definitions: {
		definition: {
			id: 'http://definition'
		}
	},
	items: [
		{
			'$ref': 'http://items'
		}
	],
	additionalItems: true,]
	additionalProperti...>
  CommonParserTest.testFromSerializer:114 expected:<<rdf:Description><j[:_type>A1</j:_type><j]p:_type>A1</jp:_type...>
but was:<<rdf:Description><j[]p:_type>A1</jp:_type...>
  RdfParserTest.testParseIntoGenericPojos:108 expected:<...ri: 'http://test/a',[ 
	f6: [
		{
			uri: 'http://test/a/a1', 
			f5: '1999-01-01T00:00:00Z', 
			f4b: 'http://test/external', 
			f4a: 'http://test/a', 
			f2: 'f2', 
			f1: '1'
		}
	], 
	f5: '1999-01-01T00:00:00Z', 
	f4b: 'http://test/external', 
	f4a: 'http://test/a', 
	f2: 'f2', 
	f1: '1', ]
	root: 'true'
}> but was:<...ri: 'http://test/a',[
	f6: [
		{
			uri: 'http://test/a/a1',
			f5: '1999-01-01T00:00:00Z',
			f4b: 'http://test/external',
			f4a: 'http://test/a',
			f2: 'f2',
			f1: '1'
		}
	],
	f5: '1999-01-01T00:00:00Z',
	f4b: 'http://test/external',
	f4a: 'http://test/a',
	f2: 'f2',
	f1: '1',]
	root: 'true'
}>
  JsonTest.testIndentation:165 expected:<...	J: {
		B: [
			'c',[ 
			{
				D: 'e'
			}, 
			[
				'f', 
				{
					G: 'h'
				}, 
				1, 
				false
			]
		]
	}, ]
	I: 'j'
}> but was:<...	J: {
		B: [
			'c',[
			{
				D: 'e'
			},
			[
				'f',
				{
					G: 'h'
				},
				1,
				false
			]
		]
	},]
	I: 'j'
}>
  XmlTest.testComparisonWithJson:81 expected:<...	name: "John Smith",[ 
	address: {
		streetAddress: "21 2nd Street", 
		city: "New York", 
		state: "NY", 
		postalCode: 10021
	}, 
	phoneNumbers: [
		"212 555-1111", 
		"212 555-2222"
	], 
	additionalInfo: null, 
	remote: false, 
	height: 62.4, ]
	"fico score": " > ...> but was:<...	name: "John Smith",[
	address: {
		streetAddress: "21 2nd Street",
		city: "New York",
		state: "NY",
		postalCode: 10021
	},
	phoneNumbers: [
		"212 555-1111",
		"212 555-2222"
	],
	additionalInfo: null,
	remote: false,
	height: 62.4,]
	"fico score": " > ...>

Tests run: 6840, Failures: 6, Errors: 0, Skipped: 2

[INFO] ------------------------------------------------------------------------
[INFO] Reactor Summary:
[INFO] 
[INFO] Apache Juneau (incubating) ......................... SUCCESS [  9.855 s]
[INFO] Apache Juneau Core ................................. SUCCESS [ 31.391 s]
[INFO] Apache Juneau Core RDF Support ..................... SUCCESS [ 11.818 s]
[INFO] Apache Juneau Core Tests ........................... FAILURE [ 24.011 s]
[INFO] Apache Juneau REST Servlet API ..................... SKIPPED
[INFO] Apache Juneau REST JAX/RS API ...................... SKIPPED
[INFO] Apache Juneau REST Client API ...................... SKIPPED
[INFO] Apache Juneau Microservice ......................... SKIPPED
[INFO] Apache Juneau REST Examples ........................ SKIPPED
[INFO] Apache Juneau REST Tests ........................... SKIPPED
[INFO] Apache Juneau UberJar .............................. SKIPPED
[INFO] Apache Juneau Distribution ......................... SKIPPED
[INFO] ------------------------------------------------------------------------
[INFO] BUILD FAILURE
[INFO] ------------------------------------------------------------------------
[INFO] Total time: 01:18 min
[INFO] Finished at: 2017-02-19T15:38:40+00:00
[INFO] Final Memory: 42M/862M
[INFO] ------------------------------------------------------------------------
[ERROR] Failed to execute goal org.apache.maven.plugins:maven-surefire-plugin:2.19.1:test
(default-test) on project juneau-core-test: There are test failures.
[ERROR] 
[ERROR] Please refer to <https://builds.apache.org/job/Juneau-Java-1.7/ws/juneau-core-test/target/surefire-reports>
for the individual test results.
[ERROR] -> [Help 1]
[ERROR] 
[ERROR] To see the full stack trace of the errors, re-run Maven with the -e switch.
[ERROR] Re-run Maven using the -X switch to enable full debug logging.
[ERROR] 
[ERROR] For more information about the errors and possible solutions, please read the following
articles:
[ERROR] [Help 1] http://cwiki.apache.org/confluence/display/MAVEN/MojoFailureException
[ERROR] 
[ERROR] After correcting the problems, you can resume the build with the command
[ERROR]   mvn <goals> -rf :juneau-core-test
Build step 'Invoke top-level Maven targets' marked build as failure

Mime
View raw message