juneau-dev mailing list archives

Site index · List index
Message view « Date » · « Thread »
Top « Date » · « Thread »
From Apache Jenkins Server <jenk...@builds.apache.org>
Subject Build failed in Jenkins: Juneau-Java-1.7 #152
Date Thu, 02 Feb 2017 21:17:43 GMT
See <https://builds.apache.org/job/Juneau-Java-1.7/152/changes>

Changes:

[jamesbognar] JUNEAU-33 - HTML5 DOM objects.

------------------------------------------
Started by an SCM change
[EnvInject] - Loading node environment variables.
Building remotely on proserpina-test (ubuntu) in workspace <https://builds.apache.org/job/Juneau-Java-1.7/ws/>
 > git rev-parse --is-inside-work-tree # timeout=10
Fetching changes from the remote Git repository
 > git config remote.origin.url https://git-wip-us.apache.org/repos/asf/incubator-juneau.git
# timeout=10
Fetching upstream changes from https://git-wip-us.apache.org/repos/asf/incubator-juneau.git
 > git --version # timeout=10
 > git -c core.askpass=true fetch --tags --progress https://git-wip-us.apache.org/repos/asf/incubator-juneau.git
+refs/heads/*:refs/remotes/origin/*
 > git rev-parse refs/remotes/origin/master^{commit} # timeout=10
 > git rev-parse refs/remotes/origin/origin/master^{commit} # timeout=10
Checking out Revision 74a90ffa768766d7d89106e54f38507150b525a6 (refs/remotes/origin/master)
 > git config core.sparsecheckout # timeout=10
 > git checkout -f 74a90ffa768766d7d89106e54f38507150b525a6
 > git rev-list d8b8e98ce60862665a4593a9cf444e3ca31bcc82 # timeout=10
[Juneau-Java-1.7] $ /home/jenkins/tools/maven/apache-maven-3.2.5/bin/mvn clean install deploy
[INFO] Scanning for projects...
[INFO] ------------------------------------------------------------------------
[INFO] Reactor Build Order:
[INFO] 
[INFO] Apache Juneau (incubating)
[INFO] Apache Juneau Core
[INFO] Apache Juneau Core RDF Support
[INFO] Apache Juneau Core Tests
[INFO] Apache Juneau REST Servlet API
[INFO] Apache Juneau REST JAX/RS API
[INFO] Apache Juneau REST Client API
[INFO] Apache Juneau Microservice
[INFO] Apache Juneau REST Examples
[INFO] Apache Juneau REST Tests
[INFO] Apache Juneau UberJar
[INFO] Apache Juneau - Examples
[INFO] Apache Juneau - Examples - Core
[INFO] Apache Juneau Distribution
[INFO]                                                                         
[INFO] ------------------------------------------------------------------------
[INFO] Building Apache Juneau (incubating) 6.0.2-incubating-SNAPSHOT
[INFO] ------------------------------------------------------------------------
[INFO] 
[INFO] --- maven-clean-plugin:3.0.0:clean (default-clean) @ juneau ---
[INFO] Deleting <https://builds.apache.org/job/Juneau-Java-1.7/ws/target>
[INFO] 
[INFO] --- maven-remote-resources-plugin:1.5:process (process-resource-bundles) @ juneau ---
[INFO] 
[INFO] --- maven-site-plugin:3.5.1:attach-descriptor (attach-descriptor) @ juneau ---
[INFO] 
[INFO] --- apache-rat-plugin:0.11:check (default) @ juneau ---
[INFO] 63 implicit excludes (use -debug for more details).
[INFO] Exclude: **/*.log
[INFO] Exclude: **/.idea
[INFO] Exclude: **/*.iml
[INFO] Exclude: **/*.classpath
[INFO] Exclude: **/*.log.*
[INFO] Exclude: **/target/**
[INFO] Exclude: DEPENDENCIES
[INFO] Exclude: true
[INFO] 21 resources included (use -debug for more details)
[INFO] Rat check: Summary of files. Unapproved: 0 unknown: 0 generated: 0 approved: 17 licence.
[INFO] 
[INFO] --- maven-install-plugin:2.5.2:install (default-install) @ juneau ---
[INFO] Installing <https://builds.apache.org/job/Juneau-Java-1.7/ws/pom.xml> to /home/jenkins/.m2/repository/org/apache/juneau/juneau/6.0.2-incubating-SNAPSHOT/juneau-6.0.2-incubating-SNAPSHOT.pom
[INFO] 
[INFO] --- maven-remote-resources-plugin:1.5:process (process-resource-bundles) @ juneau ---
[INFO] 
[INFO] --- maven-site-plugin:3.5.1:attach-descriptor (attach-descriptor) @ juneau ---
[INFO] 
[INFO] --- apache-rat-plugin:0.11:check (default) @ juneau ---
[INFO] 63 implicit excludes (use -debug for more details).
[INFO] Exclude: **/*.log
[INFO] Exclude: **/.idea
[INFO] Exclude: **/*.iml
[INFO] Exclude: **/*.classpath
[INFO] Exclude: **/*.log.*
[INFO] Exclude: **/target/**
[INFO] Exclude: DEPENDENCIES
[INFO] Exclude: true
[INFO] 21 resources included (use -debug for more details)
[INFO] Rat check: Summary of files. Unapproved: 0 unknown: 0 generated: 0 approved: 17 licence.
[INFO] 
[INFO] --- maven-install-plugin:2.5.2:install (default-install) @ juneau ---
[INFO] Installing <https://builds.apache.org/job/Juneau-Java-1.7/ws/pom.xml> to /home/jenkins/.m2/repository/org/apache/juneau/juneau/6.0.2-incubating-SNAPSHOT/juneau-6.0.2-incubating-SNAPSHOT.pom
[INFO] 
[INFO] --- maven-deploy-plugin:2.8.2:deploy (default-deploy) @ juneau ---
Downloading: https://repository.apache.org/content/repositories/snapshots/org/apache/juneau/juneau/6.0.2-incubating-SNAPSHOT/maven-metadata.xml
624/624 B   
            
Downloaded: https://repository.apache.org/content/repositories/snapshots/org/apache/juneau/juneau/6.0.2-incubating-SNAPSHOT/maven-metadata.xml
(624 B at 0.6 KB/sec)
Uploading: https://repository.apache.org/content/repositories/snapshots/org/apache/juneau/juneau/6.0.2-incubating-SNAPSHOT/juneau-6.0.2-incubating-20170202.211732-23.pom
2/10 KB     
4/10 KB   
6/10 KB   
8/10 KB   
10/10 KB   
           
Uploaded: https://repository.apache.org/content/repositories/snapshots/org/apache/juneau/juneau/6.0.2-incubating-SNAPSHOT/juneau-6.0.2-incubating-20170202.211732-23.pom
(10 KB at 9.4 KB/sec)
Downloading: https://repository.apache.org/content/repositories/snapshots/org/apache/juneau/juneau/maven-metadata.xml
365/365 B   
            
Downloaded: https://repository.apache.org/content/repositories/snapshots/org/apache/juneau/juneau/maven-metadata.xml
(365 B at 0.6 KB/sec)
Uploading: https://repository.apache.org/content/repositories/snapshots/org/apache/juneau/juneau/6.0.2-incubating-SNAPSHOT/maven-metadata.xml
624/624 B   
            
Uploaded: https://repository.apache.org/content/repositories/snapshots/org/apache/juneau/juneau/6.0.2-incubating-SNAPSHOT/maven-metadata.xml
(624 B at 0.7 KB/sec)
Uploading: https://repository.apache.org/content/repositories/snapshots/org/apache/juneau/juneau/maven-metadata.xml
365/365 B   
            
Uploaded: https://repository.apache.org/content/repositories/snapshots/org/apache/juneau/juneau/maven-metadata.xml
(365 B at 0.4 KB/sec)
[INFO]                                                                         
[INFO] ------------------------------------------------------------------------
[INFO] Building Apache Juneau Core 6.0.2-incubating-SNAPSHOT
[INFO] ------------------------------------------------------------------------
[INFO] 
[INFO] --- maven-clean-plugin:3.0.0:clean (default-clean) @ juneau-core ---
[INFO] Deleting <https://builds.apache.org/job/Juneau-Java-1.7/ws/juneau-core/target>
[INFO] 
[INFO] --- jacoco-maven-plugin:0.7.2.201409121644:prepare-agent (default-prepare-agent) @
juneau-core ---
[INFO] argLine set to -javaagent:/home/jenkins/.m2/repository/org/jacoco/org.jacoco.agent/0.7.2.201409121644/org.jacoco.agent-0.7.2.201409121644-runtime.jar=destfile=<https://builds.apache.org/job/Juneau-Java-1.7/ws/juneau-core/target/jacoco.exec>
[INFO] 
[INFO] --- maven-remote-resources-plugin:1.5:process (process-resource-bundles) @ juneau-core
---
[INFO] 
[INFO] --- maven-resources-plugin:2.7:resources (default-resources) @ juneau-core ---
[INFO] Using 'UTF-8' encoding to copy filtered resources.
[INFO] Copying 0 resource
[INFO] Copying 3 resources
[INFO] 
[INFO] --- maven-compiler-plugin:3.5.1:compile (default-compile) @ juneau-core ---
[INFO] Changes detected - recompiling the module!
[INFO] Compiling 405 source files to <https://builds.apache.org/job/Juneau-Java-1.7/ws/juneau-core/target/classes>
[INFO] <https://builds.apache.org/job/Juneau-Java-1.7/ws/juneau-core/src/main/java/org/apache/juneau/BeanSession.java>:
<https://builds.apache.org/job/Juneau-Java-1.7/ws/juneau-core/src/main/java/org/apache/juneau/BeanSession.java>
uses unchecked or unsafe operations.
[INFO] <https://builds.apache.org/job/Juneau-Java-1.7/ws/juneau-core/src/main/java/org/apache/juneau/BeanSession.java>:
Recompile with -Xlint:unchecked for details.
[INFO] -------------------------------------------------------------
[ERROR] COMPILATION ERROR : 
[INFO] -------------------------------------------------------------
[ERROR] <https://builds.apache.org/job/Juneau-Java-1.7/ws/juneau-core/src/main/java/org/apache/juneau/MediaType.java>:[76,30]
cannot find symbol
  symbol:   method putIfAbsent(java.lang.String,org.apache.juneau.MediaType)
  location: variable cache of type java.util.Map<java.lang.String,org.apache.juneau.MediaType>
[INFO] 1 error
[INFO] -------------------------------------------------------------
[INFO] ------------------------------------------------------------------------
[INFO] Reactor Summary:
[INFO] 
[INFO] Apache Juneau (incubating) ......................... SUCCESS [  8.170 s]
[INFO] Apache Juneau Core ................................. FAILURE [  7.360 s]
[INFO] Apache Juneau Core RDF Support ..................... SKIPPED
[INFO] Apache Juneau Core Tests ........................... SKIPPED
[INFO] Apache Juneau REST Servlet API ..................... SKIPPED
[INFO] Apache Juneau REST JAX/RS API ...................... SKIPPED
[INFO] Apache Juneau REST Client API ...................... SKIPPED
[INFO] Apache Juneau Microservice ......................... SKIPPED
[INFO] Apache Juneau REST Examples ........................ SKIPPED
[INFO] Apache Juneau REST Tests ........................... SKIPPED
[INFO] Apache Juneau UberJar .............................. SKIPPED
[INFO] Apache Juneau - Examples ........................... SKIPPED
[INFO] Apache Juneau - Examples - Core .................... SKIPPED
[INFO] Apache Juneau Distribution ......................... SKIPPED
[INFO] ------------------------------------------------------------------------
[INFO] BUILD FAILURE
[INFO] ------------------------------------------------------------------------
[INFO] Total time: 17.440 s
[INFO] Finished at: 2017-02-02T21:17:43+00:00
[INFO] Final Memory: 30M/723M
[INFO] ------------------------------------------------------------------------
[ERROR] Failed to execute goal org.apache.maven.plugins:maven-compiler-plugin:3.5.1:compile
(default-compile) on project juneau-core: Compilation failure
[ERROR] <https://builds.apache.org/job/Juneau-Java-1.7/ws/juneau-core/src/main/java/org/apache/juneau/MediaType.java>:[76,30]
cannot find symbol
[ERROR] symbol:   method putIfAbsent(java.lang.String,org.apache.juneau.MediaType)
[ERROR] location: variable cache of type java.util.Map<java.lang.String,org.apache.juneau.MediaType>
[ERROR] -> [Help 1]
[ERROR] 
[ERROR] To see the full stack trace of the errors, re-run Maven with the -e switch.
[ERROR] Re-run Maven using the -X switch to enable full debug logging.
[ERROR] 
[ERROR] For more information about the errors and possible solutions, please read the following
articles:
[ERROR] [Help 1] http://cwiki.apache.org/confluence/display/MAVEN/MojoFailureException
[ERROR] 
[ERROR] After correcting the problems, you can resume the build with the command
[ERROR]   mvn <goals> -rf :juneau-core
Build step 'Invoke top-level Maven targets' marked build as failure

Mime
View raw message