juneau-dev mailing list archives

Site index · List index
Message view « Date » · « Thread »
Top « Date » · « Thread »
From Apache Jenkins Server <jenk...@builds.apache.org>
Subject Build failed in Jenkins: Juneau-Java-1.7 #140
Date Wed, 28 Dec 2016 21:09:09 GMT
See <https://builds.apache.org/job/Juneau-Java-1.7/140/changes>

Changes:

[jamesbognar] JUNEAU-26 - Add support for date localization.

[jamesbognar] JUNEAU-26 - Add support for date localization. (2)

------------------------------------------
[...truncated 4584 lines...]
36/254 KB   
38/254 KB   
40/254 KB   
42/254 KB   
44/254 KB   
46/254 KB   
48/254 KB   
50/254 KB   
52/254 KB   
54/254 KB   
56/254 KB   
58/254 KB   
60/254 KB   
62/254 KB   
64/254 KB   
66/254 KB   
68/254 KB   
70/254 KB   
72/254 KB   
74/254 KB   
76/254 KB   
78/254 KB   
80/254 KB   
82/254 KB   
84/254 KB   
86/254 KB   
88/254 KB   
90/254 KB   
92/254 KB   
94/254 KB   
96/254 KB   
98/254 KB   
100/254 KB   
102/254 KB   
104/254 KB   
106/254 KB   
108/254 KB   
110/254 KB   
112/254 KB   
114/254 KB   
116/254 KB   
118/254 KB   
120/254 KB   
122/254 KB   
124/254 KB   
126/254 KB   
128/254 KB   
130/254 KB   
132/254 KB   
134/254 KB   
136/254 KB   
138/254 KB   
140/254 KB   
142/254 KB   
144/254 KB   
146/254 KB   
148/254 KB   
150/254 KB   
152/254 KB   
154/254 KB   
156/254 KB   
158/254 KB   
160/254 KB   
162/254 KB   
164/254 KB   
166/254 KB   
168/254 KB   
170/254 KB   
172/254 KB   
174/254 KB   
176/254 KB   
178/254 KB   
180/254 KB   
182/254 KB   
184/254 KB   
186/254 KB   
188/254 KB   
190/254 KB   
192/254 KB   
194/254 KB   
196/254 KB   
198/254 KB   
200/254 KB   
202/254 KB   
204/254 KB   
206/254 KB   
208/254 KB   
210/254 KB   
212/254 KB   
214/254 KB   
216/254 KB   
218/254 KB   
220/254 KB   
222/254 KB   
224/254 KB   
226/254 KB   
228/254 KB   
230/254 KB   
232/254 KB   
234/254 KB   
236/254 KB   
238/254 KB   
240/254 KB   
242/254 KB   
244/254 KB   
246/254 KB   
248/254 KB   
250/254 KB   
252/254 KB   
254/254 KB   
             
Uploaded: https://repository.apache.org/content/repositories/snapshots/org/apache/juneau/juneau-microservice/6.0.2-incubating-SNAPSHOT/juneau-microservice-6.0.2-incubating-20161228.210948-11-sources.jar
(254 KB at 205.2 KB/sec)
Uploading: https://repository.apache.org/content/repositories/snapshots/org/apache/juneau/juneau-microservice/6.0.2-incubating-SNAPSHOT/maven-metadata.xml
2/2 KB       
         
Uploaded: https://repository.apache.org/content/repositories/snapshots/org/apache/juneau/juneau-microservice/6.0.2-incubating-SNAPSHOT/maven-metadata.xml
(2 KB at 1.3 KB/sec)
[INFO]                                                                         
[INFO] ------------------------------------------------------------------------
[INFO] Building Apache Juneau Samples 6.0.2-incubating-SNAPSHOT
[INFO] ------------------------------------------------------------------------
[INFO] 
[INFO] --- maven-clean-plugin:3.0.0:clean (default-clean) @ juneau-samples ---
[INFO] Deleting <https://builds.apache.org/job/Juneau-Java-1.7/ws/juneau-samples/target>
[INFO] 
[INFO] --- maven-remote-resources-plugin:1.5:process (process-resource-bundles) @ juneau-samples
---
[INFO] 
[INFO] --- maven-resources-plugin:2.7:resources (default-resources) @ juneau-samples ---
[INFO] Using 'UTF-8' encoding to copy filtered resources.
[INFO] Copying 22 resources
[INFO] Copying 3 resources
[INFO] 
[INFO] --- maven-compiler-plugin:3.5.1:compile (default-compile) @ juneau-samples ---
[INFO] Changes detected - recompiling the module!
[INFO] Compiling 28 source files to <https://builds.apache.org/job/Juneau-Java-1.7/ws/juneau-samples/target/classes>
[INFO] 
[INFO] --- maven-resources-plugin:2.7:testResources (default-testResources) @ juneau-samples
---
[INFO] Using 'UTF-8' encoding to copy filtered resources.
[INFO] skip non existing resourceDirectory <https://builds.apache.org/job/Juneau-Java-1.7/ws/juneau-samples/src/test/resources>
[INFO] Copying 3 resources
[INFO] 
[INFO] --- maven-compiler-plugin:3.5.1:testCompile (default-testCompile) @ juneau-samples
---
[INFO] Changes detected - recompiling the module!
[INFO] Compiling 7 source files to <https://builds.apache.org/job/Juneau-Java-1.7/ws/juneau-samples/target/test-classes>
[INFO] 
[INFO] --- maven-surefire-plugin:2.19.1:test (default-test) @ juneau-samples ---

-------------------------------------------------------
 T E S T S
-------------------------------------------------------
Running org.apache.juneau.server.samples._TestSuite
No available console.
[2016.12.28 09:10:00 WARNING] Server started on port 10000
log4j:WARN No appenders could be found for logger (org.apache.http.client.protocol.RequestAddCookies).
log4j:WARN Please initialize the log4j system properly.
log4j:WARN See http://logging.apache.org/log4j/1.2/faq.html#noconfig for more info.
Warning:  org.apache.xerces.jaxp.SAXParserImpl$JAXPSAXParser: Property 'http://www.oracle.com/xml/jaxp/properties/entityExpansionLimit'
is not recognized.
Compiler warnings:
  WARNING:  'org.apache.xerces.jaxp.SAXParserImpl: Property 'http://javax.xml.XMLConstants/property/accessExternalDTD'
is not recognized.'
[2016.12.28 09:10:02 WARNING] Stopping server.

[2016.12.28 09:10:02 WARNING] Server stopped.
Tests run: 12, Failures: 0, Errors: 0, Skipped: 0, Time elapsed: 4.292 sec - in org.apache.juneau.server.samples._TestSuite
[2016.12.28 09:10:02 WARNING] Stopping server.


Results :

Tests run: 12, Failures: 0, Errors: 0, Skipped: 0

[INFO] 
[INFO] --- maven-jar-plugin:3.0.0:jar (default-jar) @ juneau-samples ---
[INFO] Building jar: <https://builds.apache.org/job/Juneau-Java-1.7/ws/juneau-samples/target/juneau-samples-6.0.2-incubating-SNAPSHOT.jar>
[INFO] 
[INFO] --- maven-site-plugin:3.5.1:attach-descriptor (attach-descriptor) @ juneau-samples
---
[INFO] 
[INFO] --- maven-shade-plugin:2.4.3:shade (default) @ juneau-samples ---
[INFO] Including org.apache.juneau:juneau-microservice:jar:6.0.2-incubating-SNAPSHOT in the
shaded jar.
[INFO] Including org.apache.juneau:juneau-server:jar:6.0.2-incubating-SNAPSHOT in the shaded
jar.
[INFO] Including org.apache.juneau:juneau-core:jar:6.0.2-incubating-SNAPSHOT in the shaded
jar.
[INFO] Including org.apache.juneau:juneau-client:jar:6.0.2-incubating-SNAPSHOT in the shaded
jar.
[INFO] Including org.eclipse.jetty.aggregate:jetty-all-server:jar:8.1.0.v20120127 in the shaded
jar.
[INFO] Including org.mortbay.jetty:servlet-api:jar:3.0.20100224 in the shaded jar.
[INFO] Including org.apache.geronimo.specs:geronimo-jta_1.1_spec:jar:1.1.1 in the shaded jar.
[INFO] Including javax.mail:mail:jar:1.4.1 in the shaded jar.
[INFO] Including javax.activation:activation:jar:1.1 in the shaded jar.
[INFO] Including org.apache.geronimo.specs:geronimo-jaspic_1.0_spec:jar:1.0 in the shaded
jar.
[INFO] Including org.apache.geronimo.specs:geronimo-annotation_1.0_spec:jar:1.1.1 in the shaded
jar.
[INFO] Including asm:asm-commons:jar:3.1 in the shaded jar.
[INFO] Including asm:asm-tree:jar:3.1 in the shaded jar.
[INFO] Including asm:asm:jar:3.1 in the shaded jar.
[INFO] Including commons-fileupload:commons-fileupload:jar:1.3.1 in the shaded jar.
[INFO] Including commons-io:commons-io:jar:2.2 in the shaded jar.
[INFO] Including org.apache.jena:jena-core:jar:2.7.1 in the shaded jar.
[INFO] Including org.apache.jena:jena-iri:jar:0.9.1 in the shaded jar.
[INFO] Including xerces:xercesImpl:jar:2.10.0 in the shaded jar.
[INFO] Including xml-apis:xml-apis:jar:1.4.01 in the shaded jar.
[INFO] Including org.slf4j:slf4j-api:jar:1.6.4 in the shaded jar.
[INFO] Including org.slf4j:slf4j-log4j12:jar:1.6.4 in the shaded jar.
[INFO] Including log4j:log4j:jar:1.2.16 in the shaded jar.
[INFO] Including org.apache.derby:derby:jar:10.10.2.0 in the shaded jar.
[INFO] Including org.apache.httpcomponents:httpmime:jar:4.5 in the shaded jar.
[INFO] Including org.apache.httpcomponents:httpclient:jar:4.5 in the shaded jar.
[INFO] Including org.apache.httpcomponents:httpcore:jar:4.4.1 in the shaded jar.
[INFO] Including commons-logging:commons-logging:jar:1.2 in the shaded jar.
[INFO] Including commons-codec:commons-codec:jar:1.9 in the shaded jar.
[INFO] Replacing original artifact with shaded artifact.
[INFO] Replacing <https://builds.apache.org/job/Juneau-Java-1.7/ws/juneau-samples/target/juneau-samples-6.0.2-incubating-SNAPSHOT.jar>
with <https://builds.apache.org/job/Juneau-Java-1.7/ws/juneau-samples/target/juneau-samples-6.0.2-incubating-SNAPSHOT-shaded.jar>
[INFO] 
[INFO] --- build-helper-maven-plugin:1.12:attach-artifact (attach-artifacts) @ juneau-samples
---
[INFO] 
[INFO] --- apache-rat-plugin:0.11:check (default) @ juneau-samples ---
[INFO] 51 implicit excludes (use -debug for more details).
[INFO] Exclude: **/*.log
[INFO] Exclude: **/*.log.*
[INFO] Exclude: **/target/**
[INFO] Exclude: DEPENDENCIES
[INFO] Exclude: true
[INFO] 63 resources included (use -debug for more details)
[INFO] Rat check: Summary of files. Unapproved: 1 unknown: 1 generated: 0 approved: 61 licence.
[INFO] ------------------------------------------------------------------------
[INFO] Reactor Summary:
[INFO] 
[INFO] Apache Juneau (incubating) ......................... SUCCESS [  8.811 s]
[INFO] Apache Juneau Core ................................. SUCCESS [ 58.076 s]
[INFO] Apache Juneau Client ............................... SUCCESS [ 10.580 s]
[INFO] Apache Juneau Server ............................... SUCCESS [ 13.651 s]
[INFO] Apache Juneau Microservice ......................... SUCCESS [ 11.413 s]
[INFO] Apache Juneau Samples .............................. FAILURE [  8.916 s]
[INFO] Apache Juneau Server Test .......................... SKIPPED
[INFO] Apache Juneau UberJar .............................. SKIPPED
[INFO] Apache Juneau Distribution ......................... SKIPPED
[INFO] ------------------------------------------------------------------------
[INFO] BUILD FAILURE
[INFO] ------------------------------------------------------------------------
[INFO] Total time: 01:53 min
[INFO] Finished at: 2016-12-28T21:10:05+00:00
[INFO] Final Memory: 86M/1445M
[INFO] ------------------------------------------------------------------------
[ERROR] Failed to execute goal org.apache.rat:apache-rat-plugin:0.11:check (default) on project
juneau-samples: Too many files with unapproved license: 1 See RAT report in: <https://builds.apache.org/job/Juneau-Java-1.7/ws/juneau-samples/target/rat.txt>
-> [Help 1]
[ERROR] 
[ERROR] To see the full stack trace of the errors, re-run Maven with the -e switch.
[ERROR] Re-run Maven using the -X switch to enable full debug logging.
[ERROR] 
[ERROR] For more information about the errors and possible solutions, please read the following
articles:
[ERROR] [Help 1] http://cwiki.apache.org/confluence/display/MAVEN/MojoFailureException
[ERROR] 
[ERROR] After correcting the problems, you can resume the build with the command
[ERROR]   mvn <goals> -rf :juneau-samples
Build step 'Invoke top-level Maven targets' marked build as failure

Mime
View raw message