juneau-dev mailing list archives

Site index · List index
Message view « Date » · « Thread »
Top « Date » · « Thread »
From Apache Jenkins Server <jenk...@builds.apache.org>
Subject Build failed in Jenkins: Juneau-Java-1.7 #81
Date Wed, 21 Sep 2016 13:29:15 GMT
See <https://builds.apache.org/job/Juneau-Java-1.7/81/changes>

Changes:

[jamesbognar] Add RAT console output to figure out why it's failing only in Jenkins.

------------------------------------------
[...truncated 166 lines...]
Running org.apache.juneau.utils.IOUtilsTest
Tests run: 1, Failures: 0, Errors: 0, Skipped: 0, Time elapsed: 0 sec - in org.apache.juneau.utils.IOUtilsTest
Running org.apache.juneau.utils.StringUtilsTest
Tests run: 19, Failures: 0, Errors: 0, Skipped: 0, Time elapsed: 0.106 sec - in org.apache.juneau.utils.StringUtilsTest
Running org.apache.juneau.utils.SimpleMapTest
Tests run: 1, Failures: 0, Errors: 0, Skipped: 0, Time elapsed: 0.005 sec - in org.apache.juneau.utils.SimpleMapTest
Running org.apache.juneau.utils.StringVarResolverTest
Tests run: 7, Failures: 0, Errors: 0, Skipped: 0, Time elapsed: 0.034 sec - in org.apache.juneau.utils.StringVarResolverTest
Running org.apache.juneau.utils.CollectionUtilsTest
Tests run: 1, Failures: 0, Errors: 0, Skipped: 0, Time elapsed: 0 sec - in org.apache.juneau.utils.CollectionUtilsTest
Running org.apache.juneau.utils.PojoRestTest
Tests run: 10, Failures: 0, Errors: 0, Skipped: 0, Time elapsed: 0.134 sec - in org.apache.juneau.utils.PojoRestTest
Running org.apache.juneau.utils.IdentityListTest
Tests run: 1, Failures: 0, Errors: 0, Skipped: 0, Time elapsed: 0.002 sec - in org.apache.juneau.utils.IdentityListTest
Running org.apache.juneau.utils.MultiIterableTest
Tests run: 1, Failures: 0, Errors: 0, Skipped: 0, Time elapsed: 0.005 sec - in org.apache.juneau.utils.MultiIterableTest
Running org.apache.juneau.utils.ClassUtilsTest
Tests run: 3, Failures: 0, Errors: 0, Skipped: 0, Time elapsed: 0.003 sec - in org.apache.juneau.utils.ClassUtilsTest
Running org.apache.juneau.utils.StringBuilderWriterTest
Tests run: 1, Failures: 0, Errors: 0, Skipped: 0, Time elapsed: 0.005 sec - in org.apache.juneau.utils.StringBuilderWriterTest
Running org.apache.juneau.utils.KeywordStoreTest
Tests run: 1, Failures: 0, Errors: 0, Skipped: 0, Time elapsed: 0.002 sec - in org.apache.juneau.utils.KeywordStoreTest
Running org.apache.juneau.utils.IOPipeTest
Tests run: 5, Failures: 0, Errors: 0, Skipped: 0, Time elapsed: 0.018 sec - in org.apache.juneau.utils.IOPipeTest
Running org.apache.juneau.utils.ByteArrayCacheTest
Tests run: 1, Failures: 0, Errors: 0, Skipped: 0, Time elapsed: 0.009 sec - in org.apache.juneau.utils.ByteArrayCacheTest
Running org.apache.juneau.utils.ByteArrayInOutStreamTest
Tests run: 1, Failures: 0, Errors: 0, Skipped: 0, Time elapsed: 0.004 sec - in org.apache.juneau.utils.ByteArrayInOutStreamTest
Running org.apache.juneau.utils.MultiSetTest
Tests run: 1, Failures: 0, Errors: 0, Skipped: 0, Time elapsed: 0.018 sec - in org.apache.juneau.utils.MultiSetTest
Running org.apache.juneau.a.rttests.RoundTripPrimitiveObjectBeansTest
Tests run: 42, Failures: 0, Errors: 0, Skipped: 0, Time elapsed: 6.561 sec - in org.apache.juneau.a.rttests.RoundTripPrimitiveObjectBeansTest
Running org.apache.juneau.a.rttests.RoundTripToObjectMapsTest
Tests run: 21, Failures: 0, Errors: 0, Skipped: 0, Time elapsed: 0.23 sec - in org.apache.juneau.a.rttests.RoundTripToObjectMapsTest
Running org.apache.juneau.a.rttests.RoundTripTransformBeansTest
Tests run: 126, Failures: 0, Errors: 0, Skipped: 0, Time elapsed: 0.955 sec - in org.apache.juneau.a.rttests.RoundTripTransformBeansTest
Running org.apache.juneau.a.rttests.RoundTripNumericConstructorsTest
Tests run: 21, Failures: 0, Errors: 0, Skipped: 0, Time elapsed: 0.041 sec - in org.apache.juneau.a.rttests.RoundTripNumericConstructorsTest
Running org.apache.juneau.a.rttests.RoundTripDTOsTest
Tests run: 42, Failures: 0, Errors: 0, Skipped: 0, Time elapsed: 1.979 sec - in org.apache.juneau.a.rttests.RoundTripDTOsTest
Running org.apache.juneau.a.rttests.RoundTripReadOnlyBeansTest
Tests run: 21, Failures: 0, Errors: 0, Skipped: 0, Time elapsed: 0.081 sec - in org.apache.juneau.a.rttests.RoundTripReadOnlyBeansTest
Running org.apache.juneau.a.rttests.RoundTripAddClassAttrsTest
Tests run: 70, Failures: 0, Errors: 0, Skipped: 0, Time elapsed: 0.629 sec - in org.apache.juneau.a.rttests.RoundTripAddClassAttrsTest
Running org.apache.juneau.a.rttests.RoundTripClassesTest
Tests run: 21, Failures: 0, Errors: 0, Skipped: 0, Time elapsed: 0.147 sec - in org.apache.juneau.a.rttests.RoundTripClassesTest
Running org.apache.juneau.a.rttests.RoundTripBeanMapsTest
Tests run: 483, Failures: 0, Errors: 0, Skipped: 0, Time elapsed: 1.987 sec - in org.apache.juneau.a.rttests.RoundTripBeanMapsTest
Running org.apache.juneau.a.rttests.RoundTripPrimitivesBeansTest
Tests run: 42, Failures: 0, Errors: 0, Skipped: 0, Time elapsed: 1.385 sec - in org.apache.juneau.a.rttests.RoundTripPrimitivesBeansTest
Running org.apache.juneau.a.rttests.RoundTripEnumTest
Tests run: 168, Failures: 0, Errors: 0, Skipped: 0, Time elapsed: 0.422 sec - in org.apache.juneau.a.rttests.RoundTripEnumTest
Running org.apache.juneau.a.rttests.RoundTripMapsTest
Tests run: 126, Failures: 0, Errors: 0, Skipped: 0, Time elapsed: 0.432 sec - in org.apache.juneau.a.rttests.RoundTripMapsTest
Running org.apache.juneau.a.rttests.RoundTripGenericsTest
Tests run: 21, Failures: 0, Errors: 0, Skipped: 0, Time elapsed: 0.057 sec - in org.apache.juneau.a.rttests.RoundTripGenericsTest
Running org.apache.juneau.a.rttests.RoundTripBeanInheritanceTest
Tests run: 42, Failures: 0, Errors: 0, Skipped: 0, Time elapsed: 0.121 sec - in org.apache.juneau.a.rttests.RoundTripBeanInheritanceTest
Running org.apache.juneau.a.rttests.RoundTripObjectsAsStringsTest
Tests run: 63, Failures: 0, Errors: 0, Skipped: 0, Time elapsed: 0.166 sec - in org.apache.juneau.a.rttests.RoundTripObjectsAsStringsTest
Running org.apache.juneau.a.rttests.RoundTripSimpleObjectsTest
Tests run: 1134, Failures: 0, Errors: 0, Skipped: 0, Time elapsed: 2.111 sec - in org.apache.juneau.a.rttests.RoundTripSimpleObjectsTest
Running org.apache.juneau.a.rttests.RoundTripLargeObjectsTest
Tests run: 1, Failures: 0, Errors: 0, Skipped: 1, Time elapsed: 0 sec - in org.apache.juneau.a.rttests.RoundTripLargeObjectsTest
Running org.apache.juneau.a.rttests.RoundTripObjectsWithSpecialMethodsTest
Tests run: 42, Failures: 0, Errors: 0, Skipped: 0, Time elapsed: 0.022 sec - in org.apache.juneau.a.rttests.RoundTripObjectsWithSpecialMethodsTest
Running org.apache.juneau.a.rttests.RoundTripTrimStringsTest
Tests run: 21, Failures: 0, Errors: 0, Skipped: 0, Time elapsed: 0.172 sec - in org.apache.juneau.a.rttests.RoundTripTrimStringsTest
Running org.apache.juneau.csv.CsvTest
Tests run: 1, Failures: 0, Errors: 0, Skipped: 0, Time elapsed: 0 sec - in org.apache.juneau.csv.CsvTest
Running org.apache.juneau.jena.RdfParserTest
Tests run: 1, Failures: 0, Errors: 0, Skipped: 0, Time elapsed: 0.034 sec - in org.apache.juneau.jena.RdfParserTest
Running org.apache.juneau.jena.CommonParserTest
2016-09-21 13:27:12,129 ERROR [el.impl.RDFDefaultErrorHandler] -- unknown-source: {E213} null
-- [main]
2016-09-21 13:27:12,136 ERROR [el.impl.RDFDefaultErrorHandler] -- (line 1 column 154): {E202}
Expecting XML start or end element(s). String data "   //foo   " not allowed. Maybe a striping
error. -- [main]
Tests run: 4, Failures: 0, Errors: 0, Skipped: 0, Time elapsed: 0.043 sec - in org.apache.juneau.jena.CommonParserTest
Running org.apache.juneau.jena.CommonTest
Tests run: 10, Failures: 0, Errors: 0, Skipped: 0, Time elapsed: 0.223 sec - in org.apache.juneau.jena.CommonTest
Running org.apache.juneau.jena.RdfTest
Tests run: 4, Failures: 0, Errors: 0, Skipped: 0, Time elapsed: 0.138 sec - in org.apache.juneau.jena.RdfTest
Running org.apache.juneau.jena.CommonXmlTest
Tests run: 2, Failures: 0, Errors: 0, Skipped: 0, Time elapsed: 0.01 sec - in org.apache.juneau.jena.CommonXmlTest
Running org.apache.juneau.ParserGenericsTest
Tests run: 2, Failures: 0, Errors: 0, Skipped: 0, Time elapsed: 0.005 sec - in org.apache.juneau.ParserGenericsTest
Running org.apache.juneau.ParserReaderTest
Tests run: 5, Failures: 0, Errors: 0, Skipped: 0, Time elapsed: 0.001 sec - in org.apache.juneau.ParserReaderTest
Running org.apache.juneau.transforms.DateFilterTest
Tests run: 6, Failures: 0, Errors: 0, Skipped: 0, Time elapsed: 0.082 sec - in org.apache.juneau.transforms.DateFilterTest
Running org.apache.juneau.transforms.CalendarSwapTest
Tests run: 43, Failures: 0, Errors: 0, Skipped: 0, Time elapsed: 0.152 sec - in org.apache.juneau.transforms.CalendarSwapTest
Running org.apache.juneau.transforms.EnumerationSwapTest
Tests run: 1, Failures: 0, Errors: 0, Skipped: 0, Time elapsed: 0 sec - in org.apache.juneau.transforms.EnumerationSwapTest
Running org.apache.juneau.transforms.BeanFilterTest
Tests run: 6, Failures: 0, Errors: 0, Skipped: 0, Time elapsed: 0.014 sec - in org.apache.juneau.transforms.BeanFilterTest
Running org.apache.juneau.transforms.ReaderFilterTest
Tests run: 1, Failures: 0, Errors: 0, Skipped: 0, Time elapsed: 0.007 sec - in org.apache.juneau.transforms.ReaderFilterTest
Running org.apache.juneau.transforms.ByteArrayBase64SwapTest
Tests run: 42, Failures: 0, Errors: 0, Skipped: 0, Time elapsed: 0.321 sec - in org.apache.juneau.transforms.ByteArrayBase64SwapTest
Running org.apache.juneau.transforms.BeanMapTest
Tests run: 2, Failures: 0, Errors: 0, Skipped: 0, Time elapsed: 0.011 sec - in org.apache.juneau.transforms.BeanMapTest
Running org.apache.juneau.transforms.IteratorSwapTest
Tests run: 1, Failures: 0, Errors: 0, Skipped: 0, Time elapsed: 0.002 sec - in org.apache.juneau.transforms.IteratorSwapTest
Running org.apache.juneau.ContextFactoryTest
Tests run: 9, Failures: 0, Errors: 0, Skipped: 0, Time elapsed: 0.113 sec - in org.apache.juneau.ContextFactoryTest
Running org.apache.juneau.xml.CommonParserTest
Tests run: 4, Failures: 0, Errors: 0, Skipped: 0, Time elapsed: 0.015 sec - in org.apache.juneau.xml.CommonParserTest
Running org.apache.juneau.xml.XmlTest
Tests run: 27, Failures: 0, Errors: 0, Skipped: 0, Time elapsed: 0.55 sec - in org.apache.juneau.xml.XmlTest
Running org.apache.juneau.xml.XmlContentTest
Tests run: 3, Failures: 0, Errors: 0, Skipped: 0, Time elapsed: 0.027 sec - in org.apache.juneau.xml.XmlContentTest
Running org.apache.juneau.xml.XmlParserTest
Tests run: 3, Failures: 0, Errors: 0, Skipped: 0, Time elapsed: 0.009 sec - in org.apache.juneau.xml.XmlParserTest
Running org.apache.juneau.xml.CommonTest
Tests run: 10, Failures: 0, Errors: 0, Skipped: 0, Time elapsed: 0.137 sec - in org.apache.juneau.xml.CommonTest
Running org.apache.juneau.xml.XmlCollapsedTest
Tests run: 9, Failures: 0, Errors: 0, Skipped: 0, Time elapsed: 0.109 sec - in org.apache.juneau.xml.XmlCollapsedTest
Running org.apache.juneau.xml.CommonXmlTest
Tests run: 2, Failures: 0, Errors: 0, Skipped: 0, Time elapsed: 0.01 sec - in org.apache.juneau.xml.CommonXmlTest
Running org.apache.juneau.ObjectListTest
Tests run: 3, Failures: 0, Errors: 0, Skipped: 0, Time elapsed: 0.004 sec - in org.apache.juneau.ObjectListTest
Running org.apache.juneau.AnnotationsTest
Tests run: 2, Failures: 0, Errors: 0, Skipped: 0, Time elapsed: 0.002 sec - in org.apache.juneau.AnnotationsTest
Running org.apache.juneau.ini.ConfigMgrTest
---Usage---
java -cp juneau.jar org.apache.juneau.ini.ConfigFile createBatchEnvFile -configFile <configFile>
-envFile <envFile> [-verbose]
java -cp juneau.jar org.apache.juneau.ini.ConfigFile createShellEnvFile -configFile <configFile>
-envFile <envFile> [-verbose]
java -cp juneau.jar org.apache.juneau.ini.ConfigFile setVals -configFile <configFile>
-vals [var1 val1 [var2 val2...]] [-verbose]
Tests run: 4, Failures: 0, Errors: 0, Skipped: 0, Time elapsed: 0.071 sec - in org.apache.juneau.ini.ConfigMgrTest
Running org.apache.juneau.ini.ConfigFileTest
Tests run: 45, Failures: 0, Errors: 0, Skipped: 0, Time elapsed: 0.11 sec - in org.apache.juneau.ini.ConfigFileTest
Running org.apache.juneau.BeanConfigTest
Tests run: 12, Failures: 0, Errors: 0, Skipped: 0, Time elapsed: 0.167 sec - in org.apache.juneau.BeanConfigTest
Running org.apache.juneau.PropertyNamerDashedLcTest
Tests run: 1, Failures: 0, Errors: 0, Skipped: 0, Time elapsed: 0 sec - in org.apache.juneau.PropertyNamerDashedLcTest
Running org.apache.juneau.IgnoredClassesTest
Tests run: 2, Failures: 0, Errors: 0, Skipped: 1, Time elapsed: 0.011 sec - in org.apache.juneau.IgnoredClassesTest
Running org.apache.juneau.msgpack.MsgPackSerialzierTest
Tests run: 1, Failures: 0, Errors: 0, Skipped: 0, Time elapsed: 0.015 sec - in org.apache.juneau.msgpack.MsgPackSerialzierTest
Running org.apache.juneau.VisibilityTest
Tests run: 1, Failures: 0, Errors: 0, Skipped: 0, Time elapsed: 0.117 sec - in org.apache.juneau.VisibilityTest
Running org.apache.juneau.ObjectMapTest
Tests run: 5, Failures: 0, Errors: 0, Skipped: 0, Time elapsed: 0.013 sec - in org.apache.juneau.ObjectMapTest
Running org.apache.juneau.html.CommonParserTest
Tests run: 4, Failures: 0, Errors: 0, Skipped: 0, Time elapsed: 0.014 sec - in org.apache.juneau.html.CommonParserTest
Running org.apache.juneau.html.CommonTest
Tests run: 11, Failures: 0, Errors: 0, Skipped: 0, Time elapsed: 0.179 sec - in org.apache.juneau.html.CommonTest
Running org.apache.juneau.html.HtmlTest
Tests run: 5, Failures: 0, Errors: 0, Skipped: 0, Time elapsed: 0.028 sec - in org.apache.juneau.html.HtmlTest
Running org.apache.juneau.internal.VersionRangeTest
Tests run: 22, Failures: 0, Errors: 0, Skipped: 0, Time elapsed: 0.016 sec - in org.apache.juneau.internal.VersionRangeTest
Running org.apache.juneau.JacocoDummyTest
Tests run: 1, Failures: 0, Errors: 0, Skipped: 0, Time elapsed: 0 sec - in org.apache.juneau.JacocoDummyTest
Running org.apache.juneau.BeanFilterTest
Tests run: 3, Failures: 0, Errors: 0, Skipped: 0, Time elapsed: 0.008 sec - in org.apache.juneau.BeanFilterTest
Running org.apache.juneau.dto.cognos.CognosXmlTest
Tests run: 1, Failures: 0, Errors: 0, Skipped: 0, Time elapsed: 0.012 sec - in org.apache.juneau.dto.cognos.CognosXmlTest
Running org.apache.juneau.dto.atom.AtomTest
Tests run: 1, Failures: 0, Errors: 0, Skipped: 0, Time elapsed: 0.107 sec - in org.apache.juneau.dto.atom.AtomTest
Running org.apache.juneau.dto.jsonschema.JsonSchemaTest
Tests run: 2, Failures: 0, Errors: 0, Skipped: 0, Time elapsed: 0.016 sec - in org.apache.juneau.dto.jsonschema.JsonSchemaTest
Running org.apache.juneau.PojoSwapTest
Tests run: 1, Failures: 0, Errors: 0, Skipped: 0, Time elapsed: 0.003 sec - in org.apache.juneau.PojoSwapTest
Running org.apache.juneau.BeanMapTest
Tests run: 36, Failures: 0, Errors: 0, Skipped: 0, Time elapsed: 0.114 sec - in org.apache.juneau.BeanMapTest
Running org.apache.juneau.json.CommonParserTest
Tests run: 4, Failures: 0, Errors: 0, Skipped: 0, Time elapsed: 0.009 sec - in org.apache.juneau.json.CommonParserTest
Running org.apache.juneau.json.CommonTest
Tests run: 11, Failures: 0, Errors: 0, Skipped: 0, Time elapsed: 0.073 sec - in org.apache.juneau.json.CommonTest
Running org.apache.juneau.json.JsonSchemaTest
Tests run: 1, Failures: 0, Errors: 0, Skipped: 0, Time elapsed: 0 sec - in org.apache.juneau.json.JsonSchemaTest
Running org.apache.juneau.json.JsonTest
Tests run: 10, Failures: 0, Errors: 0, Skipped: 0, Time elapsed: 0.013 sec - in org.apache.juneau.json.JsonTest
Running org.apache.juneau.json.JsonParserTest
Tests run: 8, Failures: 0, Errors: 0, Skipped: 0, Time elapsed: 0.264 sec - in org.apache.juneau.json.JsonParserTest
Running org.apache.juneau.DataConversionTest
Tests run: 2, Failures: 0, Errors: 0, Skipped: 0, Time elapsed: 0.01 sec - in org.apache.juneau.DataConversionTest
Running org.apache.juneau.ClassMetaTest
Tests run: 7, Failures: 0, Errors: 0, Skipped: 0, Time elapsed: 0.043 sec - in org.apache.juneau.ClassMetaTest
Running org.apache.juneau.urlencoding.CommonParser_UonTest
Tests run: 4, Failures: 0, Errors: 0, Skipped: 0, Time elapsed: 0.015 sec - in org.apache.juneau.urlencoding.CommonParser_UonTest
Running org.apache.juneau.urlencoding.UonParserReaderTest
Tests run: 1, Failures: 0, Errors: 0, Skipped: 0, Time elapsed: 0.001 sec - in org.apache.juneau.urlencoding.UonParserReaderTest
Running org.apache.juneau.urlencoding.UonSerializerTest
Tests run: 2, Failures: 0, Errors: 0, Skipped: 0, Time elapsed: 0.011 sec - in org.apache.juneau.urlencoding.UonSerializerTest
Running org.apache.juneau.urlencoding.UonParserTest
Tests run: 3, Failures: 0, Errors: 0, Skipped: 0, Time elapsed: 0.012 sec - in org.apache.juneau.urlencoding.UonParserTest
Running org.apache.juneau.urlencoding.CommonParser_UrlEncodingTest
Tests run: 5, Failures: 0, Errors: 0, Skipped: 0, Time elapsed: 0.011 sec - in org.apache.juneau.urlencoding.CommonParser_UrlEncodingTest
Running org.apache.juneau.urlencoding.UrlEncodingParserTest
Tests run: 12, Failures: 0, Errors: 0, Skipped: 0, Time elapsed: 0.061 sec - in org.apache.juneau.urlencoding.UrlEncodingParserTest
Running org.apache.juneau.urlencoding.Common_UrlEncodingTest
Tests run: 10, Failures: 0, Errors: 0, Skipped: 0, Time elapsed: 0.167 sec - in org.apache.juneau.urlencoding.Common_UrlEncodingTest
Running org.apache.juneau.urlencoding.UrlEncodingSerializerTest
Tests run: 5, Failures: 0, Errors: 0, Skipped: 0, Time elapsed: 0.071 sec - in org.apache.juneau.urlencoding.UrlEncodingSerializerTest
Running org.apache.juneau.urlencoding.Common_UonTest
Tests run: 10, Failures: 0, Errors: 0, Skipped: 0, Time elapsed: 0.108 sec - in org.apache.juneau.urlencoding.Common_UonTest

Results :

Tests run: 3038, Failures: 0, Errors: 0, Skipped: 2

[INFO] 
[INFO] --- jacoco-maven-plugin:0.7.2.201409121644:report (default-report) @ juneau-core ---
[INFO] Analyzed bundle 'Apache Juneau Core' with 512 classes
[INFO] 
[INFO] --- maven-bundle-plugin:3.2.0:bundle (default-bundle) @ juneau-core ---
[WARNING] Bundle org.apache.juneau:juneau-core:bundle:6.0.0-incubating-SNAPSHOT : Export org.apache.juneau,
 has 1,  private references [org.apache.juneau.internal], 
[WARNING] Bundle org.apache.juneau:juneau-core:bundle:6.0.0-incubating-SNAPSHOT : Export org.apache.juneau.annotation,
 has 1,  private references [org.apache.juneau.internal], 
[INFO] 
[INFO] --- maven-site-plugin:3.5.1:attach-descriptor (attach-descriptor) @ juneau-core ---
[INFO] 
[INFO] --- apache-rat-plugin:0.11:check (default) @ juneau-core ---
[INFO] 51 implicit excludes (use -debug for more details).
[INFO] Exclude: **/*.log
[INFO] Exclude: **/*.log.*
[INFO] Exclude: **/target/**
[INFO] Exclude: true
[INFO] 683 resources included (use -debug for more details)
[INFO] Rat check: Summary of files. Unapproved: 1 unknown: 1 generated: 0 approved: 568 licence.
[INFO] ------------------------------------------------------------------------
[INFO] Reactor Summary:
[INFO] 
[INFO] Apache Juneau (incubating) ......................... SUCCESS [ 15.458 s]
[INFO] Apache Juneau Core ................................. FAILURE [01:04 min]
[INFO] Apache Juneau Client ............................... SKIPPED
[INFO] Apache Juneau Server ............................... SKIPPED
[INFO] Apache Juneau Microservice ......................... SKIPPED
[INFO] Apache Juneau Samples .............................. SKIPPED
[INFO] Apache Juneau Server Test .......................... SKIPPED
[INFO] Apache Juneau UberJar .............................. SKIPPED
[INFO] Apache Juneau Distribution ......................... SKIPPED
[INFO] ------------------------------------------------------------------------
[INFO] BUILD FAILURE
[INFO] ------------------------------------------------------------------------
[INFO] Total time: 01:25 min
[INFO] Finished at: 2016-09-21T13:27:30+00:00
[INFO] Final Memory: 51M/1169M
[INFO] ------------------------------------------------------------------------
[ERROR] Failed to execute goal org.apache.rat:apache-rat-plugin:0.11:check (default) on project
juneau-core: Too many files with unapproved license: 1 See RAT report in: <https://builds.apache.org/job/Juneau-Java-1.7/ws/juneau-core/target/rat.txt>
-> [Help 1]
[ERROR] 
[ERROR] To see the full stack trace of the errors, re-run Maven with the -e switch.
[ERROR] Re-run Maven using the -X switch to enable full debug logging.
[ERROR] 
[ERROR] For more information about the errors and possible solutions, please read the following
articles:
[ERROR] [Help 1] http://cwiki.apache.org/confluence/display/MAVEN/MojoFailureException
[ERROR] 
[ERROR] After correcting the problems, you can resume the build with the command
[ERROR]   mvn <goals> -rf :juneau-core
Build step 'Invoke top-level Maven targets' marked build as failure

Mime
View raw message