ant-dev mailing list archives

Site index · List index
Message view « Date » · « Thread »
Top « Date » · « Thread »
From Diane Holt <hol...@apache.org>
Subject [GUMP] Test Failure - Ant
Date Fri, 13 Jul 2001 00:13:24 GMT
----------------------------------------------------
This email is autogenerated from the output from:
<http://jakarta.apache.org/builds/gump/2001-07-12/test-ant.html>
----------------------------------------------------

Buildfile: build.xml

dump-info:
     [echo] java.vm.info=mixed mode
     [echo] java.vm.name=Java HotSpot(TM) Client VM
     [echo] java.vm.vendor=Sun Microsystems Inc.
     [echo] java.vm.version=1.3.1-b24
     [echo] os.arch=i386
     [echo] os.name=Linux
     [echo] os.version=2.4.2-2
     [echo] file.encoding=ISO-8859-1
     [echo] user.language=en

prepare:

check_for_optional_packages:

build:
     [copy] Copying 2 files to /home/rubys/jakarta/jakarta-ant/build/classes

compile-tests:
    [mkdir] Created dir: /home/rubys/jakarta/jakarta-ant/build/testcases
    [javac] Compiling 48 source files to /home/rubys/jakarta/jakarta-ant/build/testcases
    [javac] Note: Some input files use or override a deprecated API.
    [javac] Note: Recompile with -deprecation for details.

run-tests:
    [junit] Testsuite: org.apache.tools.ant.taskdefs.AntStructureTest
    [junit] Tests run: 1, Failures: 0, Errors: 0, Time elapsed: 0.137 sec
    [junit] 
    [junit] Testsuite: org.apache.tools.ant.taskdefs.AntTest
    [junit] Tests run: 6, Failures: 0, Errors: 0, Time elapsed: 0.777 sec
    [junit] 
    [junit] Testsuite: org.apache.tools.ant.taskdefs.AvailableTest
    [junit] Tests run: 18, Failures: 0, Errors: 0, Time elapsed: 2.367 sec
    [junit] 
    [junit] Testsuite: org.apache.tools.ant.taskdefs.CVSPassTest
    [junit] Tests run: 5, Failures: 0, Errors: 0, Time elapsed: 0.532 sec
    [junit] 
    [junit] Testsuite: org.apache.tools.ant.taskdefs.CopyTest
    [junit] Tests run: 2, Failures: 0, Errors: 0, Time elapsed: 0.195 sec
    [junit] 
    [junit] Testsuite: org.apache.tools.ant.taskdefs.CopydirTest
    [junit] Tests run: 6, Failures: 0, Errors: 0, Time elapsed: 1.348 sec
    [junit] 
    [junit] Testsuite: org.apache.tools.ant.taskdefs.CopyfileTest
    [junit] Tests run: 6, Failures: 0, Errors: 0, Time elapsed: 0.574 sec
    [junit] 
    [junit] Testsuite: org.apache.tools.ant.taskdefs.DeleteTest
    [junit] Tests run: 3, Failures: 0, Errors: 0, Time elapsed: 0.542 sec
    [junit] 
    [junit] Testsuite: org.apache.tools.ant.taskdefs.DeltreeTest
    [junit] Tests run: 2, Failures: 0, Errors: 0, Time elapsed: 0.184 sec
    [junit] 
    [junit] Testsuite: org.apache.tools.ant.taskdefs.EchoTest
    [junit] Tests run: 3, Failures: 0, Errors: 0, Time elapsed: 0.255 sec
    [junit] 
    [junit] Testsuite: org.apache.tools.ant.taskdefs.ExecuteWatchdogTest
    [junit] Tests run: 4, Failures: 0, Errors: 0, Time elapsed: 20.125 sec
    [junit] 
    [junit] Testsuite: org.apache.tools.ant.taskdefs.FailTest
    [junit] Tests run: 2, Failures: 0, Errors: 0, Time elapsed: 0.251 sec
    [junit] 
    [junit] Testsuite: org.apache.tools.ant.taskdefs.FilterTest
    [junit] Tests run: 8, Failures: 0, Errors: 0, Time elapsed: 0.745 sec
    [junit] 
    [junit] Testsuite: org.apache.tools.ant.taskdefs.GetTest
    [junit] Tests run: 6, Failures: 0, Errors: 1, Time elapsed: 189.874 sec
    [junit] 
    [junit] Testcase: test6(org.apache.tools.ant.taskdefs.GetTest)::	Caused an ERROR
    [junit] java.net.ConnectException: Connection timed out
    [junit] /home/rubys/jakarta/jakarta-ant/src/etc/testcases/taskdefs/get.xml:26: java.net.ConnectException:
Connection timed out
    [junit] --- Nested Exception ---
    [junit] java.net.ConnectException: Connection timed out
    [junit] 	at java.net.PlainSocketImpl.socketConnect(Native Method)
    [junit] 	at java.net.PlainSocketImpl.doConnect(PlainSocketImpl.java:320)
    [junit] 	at java.net.PlainSocketImpl.connectToAddress(PlainSocketImpl.java:133)
    [junit] 	at java.net.PlainSocketImpl.connect(PlainSocketImpl.java:120)
    [junit] 	at java.net.Socket.<init>(Socket.java:273)
    [junit] 	at java.net.Socket.<init>(Socket.java:100)
    [junit] 	at sun.net.NetworkClient.doConnect(NetworkClient.java:50)
    [junit] 	at sun.net.www.http.HttpClient.openServer(HttpClient.java:331)
    [junit] 	at sun.net.www.http.HttpClient.openServer(HttpClient.java:517)
    [junit] 	at sun.net.www.http.HttpClient.<init>(HttpClient.java:267)
    [junit] 	at sun.net.www.http.HttpClient.<init>(HttpClient.java:277)
    [junit] 	at sun.net.www.http.HttpClient.New(HttpClient.java:289)
    [junit] 	at sun.net.www.protocol.http.HttpURLConnection.connect(HttpURLConnection.java:408)
    [junit] 	at org.apache.tools.ant.taskdefs.Get.execute(Get.java:128)
    [junit] 	at org.apache.tools.ant.Target.execute(Target.java:168)
    [junit] 	at org.apache.tools.ant.Project.runTarget(Project.java:903)
    [junit] 	at org.apache.tools.ant.Project.executeTarget(Project.java:539)
    [junit] 	at org.apache.tools.ant.taskdefs.TaskdefsTest.executeTarget(Unknown Source)
    [junit] 	at org.apache.tools.ant.taskdefs.GetTest.test6(Unknown Source)
    [junit] 	at java.lang.reflect.Method.invoke(Native Method)
    [junit] 	at junit.framework.TestCase.runTest(TestCase.java:166)
    [junit] 	at junit.framework.TestCase.runBare(TestCase.java:140)
    [junit] 	at junit.framework.TestResult$1.protect(TestResult.java:106)
    [junit] 	at junit.framework.TestResult.runProtected(TestResult.java:124)
    [junit] 	at junit.framework.TestResult.run(TestResult.java:109)
    [junit] 	at junit.framework.TestCase.run(TestCase.java:131)
    [junit] 	at junit.framework.TestSuite.runTest(TestSuite.java:173)
    [junit] 	at junit.framework.TestSuite.run(TestSuite.java:168)
    [junit] 	at org.apache.tools.ant.taskdefs.optional.junit.JUnitTestRunner.run(Unknown Source)
    [junit] 	at org.apache.tools.ant.taskdefs.optional.junit.JUnitTask.executeInVM(Unknown
Source)
    [junit] 	at org.apache.tools.ant.taskdefs.optional.junit.JUnitTask.execute(Unknown Source)
    [junit] 	at org.apache.tools.ant.taskdefs.optional.junit.JUnitTask.execute(Unknown Source)
    [junit] 	at org.apache.tools.ant.Target.execute(Target.java:168)
    [junit] 	at org.apache.tools.ant.Project.runTarget(Project.java:903)
    [junit] 	at org.apache.tools.ant.Project.executeTarget(Project.java:539)
    [junit] 	at org.apache.tools.ant.Project.executeTargets(Project.java:513)
    [junit] 	at org.apache.tools.ant.Main.runBuild(Main.java:422)
    [junit] 	at org.apache.tools.ant.Main.main(Main.java:149)
    [junit] 

BUILD FAILED

/home/rubys/jakarta/jakarta-ant/build.xml:623: Test org.apache.tools.ant.taskdefs.GetTest
failed

Total time: 3 minutes 54 seconds

Mime
View raw message